{"text_format":"1","workbook":"xlsx","n_sheets":3,"sheets":["はじめに","一覧表","概要版1"],"not_rendered":{"charts":0,"images":102,"macros":1,"external_links":0,"defined_names":3,"comments":0,"pivot_tables":0},"unopened":[],"bounds":{"document_bytes":16777216,"sheet_cells":100000,"rows_first":2000,"rows_last":500,"rows_between":2000,"halvings":0,"cell_chars":16384,"cell_head_chars":4096},"cells_cut":0,"cells_raw":0,"read":"whole","date_system":"1900"}

{"sheet":"はじめに","index":0,"n_rows":0,"n_cols":0,"rows_kept":0,"cut":false,"hidden":false,"merged":[]}

{"sheet":"一覧表","index":1,"n_rows":46,"n_cols":31,"rows_kept":46,"cut":false,"hidden":false,"merged":[[0,13,0,15],[0,21,0,23],[2,10,3,10],[2,24,3,24],[1,1,1,10],[2,0,3,0],[2,1,2,3],[2,6,3,6],[2,8,3,8],[2,9,3,9],[2,7,3,7],[2,4,3,4],[2,5,3,5],[2,28,2,30],[2,27,3,27],[2,25,3,25],[2,26,3,26],[2,11,3,11],[2,12,2,17],[2,18,2,23]]}
["有用な新技術一覧表（推奨、準推奨、評価促進）（活用促進、設計比較対象、少実績優良）（令和 4年 1月 5日現在）　　　　　　　"]
[null,"　　　　　　 推奨技術、準推奨技術、評価促進技術 ,　　　　　　　　　　　　活用促進技術、設計比較対象技術、少実績優良技術"]
["№","工種",null,null,"登録番号","技術名称","技術の位置づけ","概要版","イントラ版","公開版","概要、新規性及び期待される効果等","比較する従来技術","申請情報",null,null,null,null,null,"評価結果　（Ｃ：同程度）",null,null,null,null,null,null,"副題","開発者名","登録番号","工種"]
[null,"レベル１","レベル２","レベル３",null,null,null,null,null,null,null,null,"経済性","工程","品質","安全性","施工性","環境","経済性","工程","品質","安全性","施工性","環境",null,null,null,null,"レベル１","レベル２","レベル３"]
[1,"橋梁上部工","橋梁用伸縮継手装置設置工",null,"HK-140002-VE","橋梁用埋設型排水桝","準推奨",{"$f":"HYPERLINK(\"#概要版1!b\"&MATCH(E5,概要版1!B:B,0),\"概要版\")","v":"概要版"},{"$f":"HYPERLINK(\"https://www.netis.mlit.go.jp/internalnetis/pubsearch/details?regNo=\"&LEFT(E5,9)&\"&TabType=2&nt=nt\",\"イントラ版\")","v":"イントラ版"},{"$f":"HYPERLINK(\"https://www.netis.mlit.go.jp/netis/pubsearch/details?regNo=\"&LEFT(E5,9)&\"&TabType=2&nt=nt\",\"公開版\")","v":"公開版"},"本製品はコンクリート床版上の雨水を排水するための床版排水用の雨水桝です。 伸縮装置取り換え工事と同時に設置を行い、遊間を利用して排水する技術です。 コアドリルによる削孔作業が不要なため施工が早いのが最大の特徴です。","溶融亜鉛メッキ製 水抜き管(床版を削孔して設置する場合)","向上(17%)","短縮(75%)","同程度","同程度","向上","同程度","B","B","B","C","B","C",null,"・上面+側面集水型「D3(ディースリー)パイプ」 ・側面集水型「ジョイントドレーン」","中大実業株式会社 西日本高速道路メンテナンス関西株式会社 ",{"$f":"HYPERLINK(\"http://www.netis.mlit.go.jp/NetisRev/Search/NtList.asp?registflg=true&qt=\"&E5&\"&hyouka=1&shinsei=1&search_type=1&TabType=2&Search=NewIndex&gcd=0&page=0&expnum=10\",E5)","v":"HK-140002-VE"},{"$f":"IF(B5=\"\",\"\",B5)","v":"橋梁上部工"},{"$f":"IF(C5=\"\",\"\",C5)","v":"橋梁用伸縮継手装置設置工"},{"$f":"IF(D5=\"\",\"\",D5)","v":""}]
[{"$f":"A5+1","v":2},"調査試験","構造物調査","非破壊試験、調査","KK-150069-VE","鋼製埋設部路面境界部の損傷判定、診断方法","準推奨",{"$f":"HYPERLINK(\"#概要版1!b\"&MATCH(E6,概要版1!B:B,0),\"概要版\")","v":"概要版"},"イントラ版","公開版","本技術は、パルス渦流法による迅速スクリーニング及び超音波表面SH波法による詳細検査を組合せ、効率的に路面境界部の損傷状況を可視化することを特徴とし、本技術の活用により品質、経済性、安全性、施工性の向上と工程の短縮が期待できる。","掘削による鋼製埋設物路面境界部の腐食状況検査","向上\n(56%)\n","短縮\n(81%)\n","向上","向上","向上","向上","B","B","B","B","B","A",null,"パルス渦流法、超音波法を併用した路面境界部(地際腐食)の非破壊検査システム","株式会社コベルコ科研、神鋼検査サービス株式会社",{"$f":"HYPERLINK(\"http://www.netis.mlit.go.jp/NetisRev/Search/NtList.asp?registflg=true&qt=\"&E6&\"&hyouka=1&shinsei=1&search_type=1&TabType=2&Search=NewIndex&gcd=0&page=0&expnum=10\",E6)","v":"KK-150069-VE"},{"$f":"IF(B6=\"\",\"\",B6)","v":"調査試験"},{"$f":"IF(C6=\"\",\"\",C6)","v":"構造物調査"},{"$f":"IF(D6=\"\",\"\",D6)","v":"非破壊試験、調査"}]
[{"$f":"A6+1","v":3},"調査試験","構造物調査","非破壊試験、調査","KT-130057-VE","支柱路面境界部検査システム","準推奨",{"$f":"HYPERLINK(\"#概要版1!b\"&MATCH(E7,概要版1!B:B,0),\"概要版\")","v":"概要版"},{"$f":"HYPERLINK(\"https://www.netis.mlit.go.jp/internalnetis/pubsearch/details?regNo=\"&LEFT(E7,9)&\"&TabType=2&nt=nt\",\"イントラ版\")","v":"イントラ版"},{"$f":"HYPERLINK(\"https://www.netis.mlit.go.jp/netis/pubsearch/details?regNo=\"&LEFT(E7,9)&\"&TabType=2&nt=nt\",\"公開版\")","v":"公開版"},"本技術は、複数のモードの超音波を使用して支柱路面境界部の検査を行う技術で、従来は、掘削後に目視および超音波厚さ計で行う検査で対応していた。本技術の活用により、掘削・復旧の工程がなくなるので、工期短縮、安全性の向上が図れます。","掘削後に目視および超音波厚さ計で行う検査","低下(-10%)","短縮(62%)","同程度","向上","向上","同程度","A","A","C","B","B","B",null,"超音波による路面境界部の非破壊検査システム「キズミー1」","株式会社リンク、MKエンジニアリング株式会社",{"$f":"HYPERLINK(\"http://www.netis.mlit.go.jp/NetisRev/Search/NtList.asp?registflg=true&qt=\"&E7&\"&hyouka=1&shinsei=1&search_type=1&TabType=2&Search=NewIndex&gcd=0&page=0&expnum=10\",E7)","v":"KT-130057-VE"},"調査試験","構造物調査","非破壊試験、調査"]
[{"$f":"A7+1","v":4},"コンクリート工","コンクリート工","鉄筋工","KT-170065-VE","錆転化処理剤・鉄筋防錆剤「ラストクエンチ」","活用促進",{"$f":"HYPERLINK(\"#概要版1!b\"&MATCH(E8,概要版1!B:B,0),\"概要版\")","v":"概要版"},{"$f":"HYPERLINK(\"https://www.netis.mlit.go.jp/internalnetis/pubsearch/details?regNo=\"&LEFT(E8,9)&\"&TabType=2&nt=nt\",\"イントラ版\")","v":"イントラ版"},{"$f":"HYPERLINK(\"https://www.netis.mlit.go.jp/netis/pubsearch/details?regNo=\"&LEFT(E8,9)&\"&TabType=2&nt=nt\",\"公開版\")","v":"公開版"},"本技術は、錆びた部分等の鉄筋の塗布型錆転化処理剤及び防錆剤(ラストクエンチ)で、従来は、鉄筋の錆をケレン作業で除去した後、防錆剤を塗布していた。本技術の活用により、ケレン作業等が省け工程が短縮し経済性が向上。複雑な配筋部等でも作業が可能で施工性も向上する。 ","錆びた鉄筋にケレン作業を施した後、防錆剤を塗布 ","向上\n(45%)\n","短縮\n(53%)\n","同程度","向上","向上","向上","B","B","B","B","A","B",null,"錆びた鉄筋に塗布するだけで鉄材や赤錆部分を安定して強固な黒皮被膜に転化し、さらに樹脂皮膜を形成することによって防錆効果を発揮。付着を妨げない錆転化型防錆剤","株式会社ノックス ",{"$f":"HYPERLINK(\"http://www.netis.mlit.go.jp/NetisRev/Search/NtList.asp?registflg=true&qt=\"&E8&\"&hyouka=1&shinsei=1&search_type=1&TabType=2&Search=NewIndex&gcd=0&page=0&expnum=10\",E8)","v":"KT-170065-VE"},{"$f":"IF(B8=\"\",\"\",B8)","v":"コンクリート工"},"コンクリート工","鉄筋工"]
[{"$f":"A8+1","v":5},"コンクリート工","コンクリート工","その他","KT-130065-VE","無機質けい酸塩系含浸材「ポルトガードプレクサス」","活用促進",{"$f":"HYPERLINK(\"#概要版1!b\"&MATCH(E9,概要版1!B:B,0),\"概要版\")","v":"概要版"},{"$f":"HYPERLINK(\"https://www.netis.mlit.go.jp/internalnetis/pubsearch/details?regNo=\"&LEFT(E9,9)&\"&TabType=2&nt=nt\",\"イントラ版\")","v":"イントラ版"},{"$f":"HYPERLINK(\"https://www.netis.mlit.go.jp/netis/pubsearch/details?regNo=\"&LEFT(E9,9)&\"&TabType=2&nt=nt\",\"公開版\")","v":"公開版"},"本技術はコンクリート表面保護に用いる散水養生不要のけい酸塩系含浸材であり、従来は散水養生を必要とするけい酸塩系含浸材で対応していた。本技術の活用によりカリウムの反応促進作用により散水養生が不要となるため、施工性の向上と経済性の向上が得られる。","散水養生を必要とするけい酸塩系含浸材\n","向上\n(30%)\n","短縮\n(67%)\n","同程度","同程度","向上","―","B","B","C","C","B","C",null,"散水養生が不要なけい酸塩系(ナトリウム・カリウム・リチウム混合型)含浸材","株式会社セントラルコンクリート、株式会社グリーンドゥ",{"$f":"HYPERLINK(\"http://www.netis.mlit.go.jp/NetisRev/Search/NtList.asp?registflg=true&qt=\"&E9&\"&hyouka=1&shinsei=1&search_type=1&TabType=2&Search=NewIndex&gcd=0&page=0&expnum=10\",E9)","v":"KT-130065-VE"},"コンクリート工","コンクリート工","その他"]
[6,"コンクリート工","コンクリート工","その他","CG-160013-VE","けい酸塩系表面含浸材CS-21ネオ","活用促進",{"$f":"HYPERLINK(\"#概要版1!b\"&MATCH(E10,概要版1!B:B,0),\"概要版\")","v":"概要版"},"イントラ版","公開版","新設コンクリート構造物の表面保護に最適で、施工性が良好な反応型けい酸塩系表面含浸材。施工は清掃後の表面に材料を1回塗布のみで散水は不要。継続的な微細空隙の充填効果により、かぶりを健全に保ち鋼材腐食を抑制。更なる品質向上、耐久性向上、長寿命化に寄与する。 ","表面含浸工法(反応型けい酸塩系表面含浸工法)","向上\n(59%)\n","短縮\n(67%)\n","向上","向上","向上","同程度","B","B","C","C","B","C",null,"新設コンクリート構造物の表面保護","株式会社アストン","CG-160013-VE","コンクリート工","コンクリート工","その他"]
[7,"コンクリート工","その他",null,"CB-130007-VE","ひび割れ補修浸透性エポキシ樹脂塗布工法","活用促進",{"$f":"HYPERLINK(\"#概要版1!b\"&MATCH(E11,概要版1!B:B,0),\"概要版\")","v":"概要版"},"イントラ版","公開版","ひび割れの奥まで補修する際に低圧注入器具を用いて補修材を注入していたのに対し、塗布だけでひび割れに補修材が浸透する工法です。 浸透性エポキシ樹脂接着剤「アルファテック388」を繰り返し塗布することで毛細管現象によってひび割れ内部にまで浸透します。","低圧注入工法 ","向上\n(53%)\n","短縮\n(75%)\n","向上","同程度","向上","向上","B","B","C","C","B","B",null,"塗布・浸透型ひび割れ補修材アルファテック388","中日本高速技術マーケティング株式会社 アルファ工業株式会社","CB-130007-VE",{"$f":"IF(B11=\"\",\"\",B11)","v":"コンクリート工"},{"$f":"IF(C11=\"\",\"\",C11)","v":"その他"},{"$f":"IF(D11=\"\",\"\",D11)","v":""}]
[8,"道路維持修繕工","橋梁補修補強工","断面修復工","QS-150017-VR","コンクリート構造物の断面修復材料「ゴムラテシリーズ」","活用促進",{"$f":"HYPERLINK(\"#概要版1!b\"&MATCH(E12,概要版1!B:B,0),\"概要版\")","v":"概要版"},{"$f":"HYPERLINK(\"https://www.netis.mlit.go.jp/internalnetis/pubsearch/details?regNo=\"&LEFT(E12,9)&\"&TabType=2&nt=nt\",\"イントラ版\")","v":"イントラ版"},{"$f":"HYPERLINK(\"https://www.netis.mlit.go.jp/netis/pubsearch/details?regNo=\"&LEFT(E12,9)&\"&TabType=2&nt=nt\",\"公開版\")","v":"公開版"},"超速硬ポリマーセメントモルタルまたはコンクリートにより、劣化損傷したコンクリート構造物の断面修復を行う技術で、従来は、超速硬コンクリートで対応していた。本技術の活用により、乾燥収縮が小さく、付着性・耐久性に優れた断面修復が可能である。","超速硬コンクリート","向上\n(37%)\n","短縮\n(33%)\n","向上","同程度","向上","向上","B","B","B","C","B","B",null,"プレミックス型超速硬ポリマーセメントモルタル・コンクリート","太平洋マテリアル株式会社 ","QS-150017-VR",{"$f":"IF(B12=\"\",\"\",B12)","v":"道路維持修繕工"},"橋梁補修補強工","断面修復工"]
[9,"道路維持修繕工","橋梁補修補強工","表面保護工　","CB-120013-VR","ハイブリッド形表面被覆材アロンブルコートZ-X、Z-Y工法　","活用促進",{"$f":"HYPERLINK(\"#概要版1!b\"&MATCH(E13,概要版1!B:B,0),\"概要版\")","v":"概要版"},"イントラ版","公開版","従来主流のコンクリート表面保護工は、エポキシ樹脂系材料であるが紫外線劣化により割れ剥がれが多く発生している。本工法は、コスト縮減・工程短縮・品質向上・施工性等に着目し開発した材料(セメント系無機質硬化材を主とし、アクリルゴムを混合)を用いる新工法である。 ","エポキシ樹脂系表面被覆材を用いた剥落防止工法","向上\n(8%)\n","短縮\n(20%)\n","向上","向上","向上","向上","B","B","B","C","B","B",null,"本工法は、工程短縮・品質向上・施工性にこだわって開発した材料(セメント系無機質硬化剤を主とし、アクリルゴムを混合)を用いる、コンクリート表面保護工法の新工法。","東亞合成株式会社、株式会社駒井ハルテック","CB-120013-VR","道路維持修繕工","橋梁補修補強工","表面保護工　"]
[10,"道路維持修繕工","橋梁補修補強工","表面保護工","KT-130009-VR","シリケートガード","活用促進",{"$f":"HYPERLINK(\"#概要版1!b\"&MATCH(E14,概要版1!B:B,0),\"概要版\")","v":"概要版"},"イントラ版","公開版","本技術は、施工時に反応促進剤を混合する2液性のけい酸塩系表面含浸材で、従来は1液性のけい酸塩系表面含浸材で対応していた。本技術の活用により、1回の塗布回数で施工できるため、施工性が良くなり、工期の短縮、経済性の向上が図れる。 ","1液性のけい酸塩系表面含浸材","向上\n(50%)\n","短縮\n(25%)\n","向上","同程度","向上","同程度","B","B","B","C","B","C",null,"コンクリート表面の緻密化により劣化を抑制し耐摩耗性を向上させるけい酸塩系表面含浸材","ショーボンド建設株式会社 , 有限会社シモダ技術研究所 ","KT-130009-VR","道路維持修繕工","橋梁補修補強工","表面保護工"]
[11,"道路維持修繕工","橋梁補修補強工","表面保護工","KT-120082-VR","ワンステップガード工法","活用促進",{"$f":"HYPERLINK(\"#概要版1!b\"&MATCH(E15,概要版1!B:B,0),\"概要版\")","v":"概要版"},"イントラ版","公開版","本技術は、特殊有機短繊維を混合したアクリル樹脂を塗布する方式のコンクリート片はく落防止対策工法で、従来は繊維シート接着工法で対応していた。本技術の活用により、シート接着工程が削減ができるので、工程の短縮、経済性の向上が図れる。","繊維シート接着工法 ","向上\n(28%)\n","短縮\n(58%)\n","同程度","同程度","同程度","向上","B","B","C","B","B","C",null,"短繊維混合樹脂によるコンクリート片はく落防止対策工法","電気化学工業株式会社 ","KT-120082-VR",{"$f":"IF(B15=\"\",\"\",B15)","v":"道路維持修繕工"},"橋梁補修補強工","表面保護工"]
[12,"道路維持修繕工","橋梁補修補強工","新素材繊維接着工　","CG-120025-VE","超薄膜スケルトンはく落防災コーティング","活用促進",{"$f":"HYPERLINK(\"#概要版1!b\"&MATCH(E16,概要版1!B:B,0),\"概要版\")","v":"概要版"},"イントラ版","公開版","透明特殊コーティング材とガラス連続繊維シートの含浸接着による、透けて見えるコンクリート構造物のはく落防止機能付き表面保護工法(繊維シートを使用しない場合は小片はく落防止機能)。塗膜の超薄膜化によってコーティング材の使用量を抑え経済性の向上を果たした。","ビニロン繊維シート工法","向上\n(4%)\n","短縮\n(33%)\n","向上","同程度","向上","向上","B","B","B","C","B","C",null,"透明特殊コーティング材とガラス連続繊維シートの含浸接着による、透けて見えるコンクリート構造物のはく落防止機能(繊維シートを使用しない場合は小片はく落防止機能)付き表面保護工法","株式会社エムビーエス","CG-120025-VE",{"$f":"IF(B16=\"\",\"\",B16)","v":"道路維持修繕工"},"橋梁補修補強工","新素材繊維接着工　"]
[13,"道路維持修繕工","橋梁補修補強工","防食対策工","KT-150081-VR","EPP(エコ・ペイント・ピーリング)工法","活用促進",{"$f":"HYPERLINK(\"#概要版1!b\"&MATCH(E17,概要版1!B:B,0),\"概要版\")","v":"概要版"},"イントラ版","公開版","本技術は、水性剥離剤を、橋梁などの塗膜に塗布することで、塗膜を浮き上がらせ除去する工法です。従来はブラスト工法を用いていました。本技術の活用により、塗膜除去時の粉塵と騒音の発生を防止できます。塗膜に有害物質を含む場合は特に有効です。 ","ブラスト工法 ","向上\n(48%)\n","短縮\n(43%)\n","低下","向上","同程度","向上","B","B","C","B","B","B",null,"水性塗膜剥離剤による塗膜の剥離工法","JFEエンジニアリング株式会社 ","KT-150081-VR","道路維持修繕工","橋梁補修補強工","防食対策工"]
[14,"道路維持修繕工","橋梁補修補強工","防食対策工","QS-150032-VE","循環式ハイブリッドブラストシステム","活用促進",{"$f":"HYPERLINK(\"#概要版1!b\"&MATCH(E18,概要版1!B:B,0),\"概要版\")","v":"概要版"},"イントラ版","公開版","橋梁補修補強工等において、鋼構造物の素地調整(1種ケレン)やコンクリート劣化部のチッピングを行う循環式機能付ブラスト工法で、従来は、エアーブラストで対応していた。本技術の活用により、ケレンかすから研削材を吸引再利用できるため、産業廃棄物を削減できる。 ","エアーブラスト(加圧式) ","向上\n(24%)\n","短縮\n(29%)\n","同程度","同程度","向上","向上","B","C","C","C","B","B",null,"研削材の再利用および設備の車載対応が可能なブラスト工法","株式会社イヤマトータルブリッジサポート","QS-150032-VE","道路維持修繕工","橋梁補修補強工","防食対策工"]
[15,"道路維持修繕工","橋梁補修補強工","防食対策工","HK-160021-VE","ECO-SCOP工法","活用促進",{"$f":"HYPERLINK(\"#概要版1!b\"&MATCH(E19,概要版1!B:B,0),\"概要版\")","v":"概要版"},{"$f":"HYPERLINK(\"https://www.netis.mlit.go.jp/internalnetis/pubsearch/details?regNo=\"&LEFT(E19,9)&\"&TabType=2&nt=nt\",\"イントラ版\")","v":"イントラ版"},{"$f":"HYPERLINK(\"https://www.netis.mlit.go.jp/netis/pubsearch/details?regNo=\"&LEFT(E19,9)&\"&TabType=2&nt=nt\",\"公開版\")","v":"公開版"},"分析用途の塗膜採取の従来技術は、素地調整2種が用いられているが、本技術の採取用具を用いることで、塗膜の採取コスト、作業工程と日数を各段に低減し、塗膜に含む有害物質から作業員の安全と周辺環境の汚染および二次汚染廃棄物の発生が防止できる。 ","素地調整2種 ","向上\n(59%)\n","短縮\n(82%)\n","向上","向上","向上","向上","B","B","C","B","B","B",null,"分析用途の塗膜採取及び回収方法","防食塗装研究所 ",{"$f":"HYPERLINK(\"http://www.netis.mlit.go.jp/NetisRev/Search/NtList.asp?registflg=true&qt=\"&E19&\"&hyouka=1&shinsei=1&search_type=1&TabType=2&Search=NewIndex&gcd=0&page=0&expnum=10\",E19)","v":"HK-160021-VE"},{"$f":"IF(B19=\"\",\"\",B19)","v":"道路維持修繕工"},{"$f":"IF(C19=\"\",\"\",C19)","v":"橋梁補修補強工"},{"$f":"IF(D19=\"\",\"\",D19)","v":"防食対策工"}]
[16,"道路維持修繕工","橋梁補修補強工","その他","KT-120008-VE","コンパクト ストッパー (KCS)","活用促進",{"$f":"HYPERLINK(\"#概要版1!b\"&MATCH(E20,概要版1!B:B,0),\"概要版\")","v":"概要版"},"イントラ版","公開版","本技術は水平2方向及び上向き(上揚力)の地震力に抵抗する緩衝ゴム付き変位制限装置であり、従来は鋼製ブラケットによる変位制限装置により対応していた。本技術の活用により、上向き地震力に抵抗可能な構造としたことにより、地震時における品質の向上となる。 ","鋼製ブラケットによる変位制限装置。","向上\n(5%)\n","短縮\n(4%)\n","向上","同程度","向上","同程度","B","B","B","C","B","C",null,"橋梁用の上揚力対応型水平ストッパー","株式会社川金コアテック","KT-120008-VE",{"$f":"IF(B20=\"\",\"\",B20)","v":"道路維持修繕工"},{"$f":"IF(C20=\"\",\"\",C20)","v":"橋梁補修補強工"},{"$f":"IF(D20=\"\",\"\",D20)","v":"その他"}]
{"$rows_left_out":27}
{"sheet":"概要版1","index":2,"n_rows":1006,"n_cols":17,"rows_kept":1006,"cut":false,"hidden":false,"merged":[[962,1,983,1],[703,3,703,16],[890,1,911,1],[900,3,900,10],[901,3,901,10],[902,3,902,10],[968,12,968,16],[434,1,455,1],[924,3,924,10],[925,3,925,10],[926,3,926,10],[927,4,927,9],[939,7,939,11],[942,3,942,16],[943,3,943,16],[946,3,946,10],[946,12,946,15],[948,3,948,10],[949,3,949,10],[950,3,950,10],[614,3,614,10],[615,4,615,9],[566,3,566,10],[567,4,567,9],[866,1,887,1],[867,7,867,11],[870,3,870,16],[871,3,871,16],[914,1,935,1],[915,7,915,11],[918,3,918,16],[919,3,919,16],[922,3,922,10],[922,12,922,15],[423,4,423,9],[613,3,613,10],[637,3,637,10],[638,3,638,10],[999,4,999,9],[975,4,975,9],[634,3,634,10],[634,12,634,15],[636,3,636,10],[726,3,726,16],[606,3,606,16],[607,3,607,16],[610,3,610,10],[610,12,610,15],[612,3,612,10],[492,3,492,10],[493,3,493,10],[903,4,903,9],[775,3,775,16],[994,12,994,15],[996,3,996,10],[997,3,997,10],[998,3,998,10],[973,3,973,10],[319,3,319,16],[322,3,322,10],[396,3,396,10],[397,3,397,10],[398,3,398,10],[391,3,391,16],[348,3,348,10],[349,3,349,10],[350,3,350,10],[351,4,351,9],[392,12,392,17],[394,3,394,10],[394,12,394,15],[339,7,339,11],[342,3,342,16],[343,3,343,16],[346,3,346,10],[346,12,346,15],[320,12,320,16],[363,7,363,11],[366,3,366,16],[367,3,367,16],[399,4,399,9],[390,3,390,16],[414,3,414,16],[415,3,415,16],[418,3,418,10],[418,12,418,15],[420,3,420,10],[421,3,421,10],[422,3,422,10],[174,3,174,16],[318,3,318,16],[267,7,267,11],[266,1,287,1],[242,1,263,1],[180,3,180,10],[181,3,181,10],[270,3,270,16],[271,3,271,16],[274,3,274,10],[298,3,298,10],[298,12,298,15],[300,3,300,10],[274,12,274,15],[302,3,302,10],[303,4,303,9],[175,3,175,16],[178,12,178,15],[290,1,311,1],[291,7,291,11],[294,3,294,16],[295,3,295,16],[974,3,974,10],[708,3,708,10],[709,3,709,10],[710,3,710,10],[970,12,970,15],[972,3,972,10],[728,12,728,16],[874,3,874,10],[874,12,874,15],[876,3,876,10],[877,3,877,10],[878,3,878,10],[879,4,879,9],[891,7,891,11],[894,3,894,16],[895,3,895,16],[898,3,898,10],[778,3,778,10],[963,7,963,11],[966,3,966,16],[967,3,967,16],[970,3,970,10],[951,4,951,9],[778,12,778,15],[706,3,706,10],[706,12,706,15],[370,3,370,10],[370,12,370,15],[372,3,372,10],[373,3,373,10],[314,1,335,1],[315,7,315,11],[386,1,407,1],[322,12,322,15],[324,3,324,10],[325,3,325,10],[326,3,326,10],[327,4,327,9],[362,1,383,1],[602,1,623,1],[530,1,551,1],[554,1,575,1],[626,1,647,1],[506,1,527,1],[674,1,695,1],[650,1,671,1],[338,1,359,1],[516,3,516,10],[517,3,517,10],[518,3,518,10],[898,12,898,15],[374,3,374,10],[375,4,375,9],[387,7,387,11],[830,3,830,10],[831,4,831,9],[699,7,699,11],[702,3,702,16],[687,4,687,9],[651,7,651,11],[639,4,639,9],[682,3,682,10],[682,12,682,15],[711,4,711,9],[684,3,684,10],[685,3,685,10],[686,3,686,10],[850,12,850,15],[519,4,519,9],[663,4,663,9],[654,3,654,16],[675,7,675,11],[560,12,560,16],[630,3,630,16],[658,12,658,15],[660,3,660,10],[661,3,661,10],[662,3,662,10],[627,7,627,11],[655,3,655,16],[658,3,658,10],[603,7,603,11],[562,3,562,10],[11,3,11,10],[12,3,12,10],[13,3,13,10],[14,4,14,9],[7,12,7,16],[20,13,21,15],[1,1,22,1],[2,7,2,11],[5,3,5,16],[9,3,9,10],[9,12,9,15],[57,3,57,10],[62,4,62,9],[50,7,50,11],[53,3,53,16],[54,3,54,16],[25,1,46,1],[26,7,26,11],[29,3,29,16],[30,3,30,16],[33,3,33,10],[33,12,33,15],[35,3,35,10],[36,3,36,10],[37,3,37,10],[38,4,38,9],[49,1,70,1],[59,3,59,10],[60,3,60,10],[61,3,61,10],[57,12,57,15],[97,1,118,1],[98,7,98,11],[101,3,101,16],[102,3,102,16],[105,3,105,10],[105,12,105,15],[107,3,107,10],[108,3,108,10],[109,3,109,10],[110,4,110,9],[121,1,142,1],[122,7,122,11],[125,3,125,16],[126,3,126,16],[156,3,156,10],[218,1,239,1],[219,7,219,11],[222,3,222,16],[226,3,226,10],[226,12,226,15],[228,3,228,10],[229,3,229,10],[230,3,230,10],[231,4,231,9],[194,1,215,1],[195,7,195,11],[198,3,198,16],[199,3,199,16],[202,3,202,10],[202,12,202,15],[204,3,204,10],[205,3,205,10],[206,3,206,10],[178,3,178,10],[842,1,863,1],[730,3,730,10],[730,12,730,15],[732,3,732,10],[733,3,733,10],[734,3,734,10],[735,4,735,9],[852,3,852,10],[853,3,853,10],[854,3,854,10],[855,4,855,9],[818,1,839,1],[819,7,819,11],[822,3,822,16],[823,3,823,16],[826,3,826,10],[826,12,826,15],[828,3,828,10],[829,3,829,10],[722,1,743,1],[723,7,723,11],[781,3,781,10],[782,3,782,10],[783,4,783,9],[938,1,959,1],[986,1,1007,1],[987,7,987,11],[990,3,990,16],[991,3,991,16],[994,3,994,10],[698,1,719,1],[843,7,843,11],[846,3,846,16],[847,3,847,16],[850,3,850,10],[746,1,767,1],[747,7,747,11],[750,3,750,16],[751,3,751,16],[754,3,754,10],[754,12,754,15],[756,3,756,10],[757,3,757,10],[758,3,758,10],[759,4,759,9],[770,1,791,1],[771,7,771,11],[774,3,774,16],[145,1,166,1],[514,3,514,10],[514,12,514,15],[158,4,158,9],[146,7,146,11],[149,3,149,16],[151,12,151,16],[490,12,490,15],[435,7,435,11],[494,3,494,10],[495,4,495,9],[207,4,207,9],[224,12,224,16],[276,3,276,10],[277,3,277,10],[278,3,278,10],[279,4,279,9],[301,3,301,10],[243,7,243,11],[246,3,246,16],[442,3,442,10],[442,12,442,15],[170,1,191,1],[171,7,171,11],[86,4,86,9],[247,3,247,16],[250,3,250,10],[250,12,250,15],[252,3,252,10],[253,3,253,10],[254,3,254,10],[255,4,255,9],[81,3,81,10],[81,12,81,15],[83,3,83,10],[84,3,84,10],[129,3,129,10],[129,12,129,15],[131,3,131,10],[132,3,132,10],[133,3,133,10],[150,3,150,16],[153,3,153,10],[153,12,153,15],[155,3,155,10],[157,3,157,10],[182,3,182,10],[183,4,183,9],[74,7,74,11],[77,3,77,16],[78,3,78,16],[73,1,94,1],[578,1,599,1],[579,7,579,11],[582,3,582,16],[586,3,586,10],[586,12,586,15],[588,3,588,10],[589,3,589,10],[590,3,590,10],[591,4,591,9],[555,7,555,11],[558,3,558,16],[447,4,447,9],[410,1,431,1],[411,7,411,11],[440,12,440,16],[134,4,134,9],[490,3,490,10],[482,1,503,1],[486,3,486,16],[85,3,85,10],[794,1,815,1],[795,7,795,11],[798,3,798,16],[799,3,799,16],[802,3,802,10],[802,12,802,15],[804,3,804,10],[805,3,805,10],[806,3,806,10],[807,4,807,9],[458,1,479,1],[459,7,459,11],[462,3,462,16],[464,12,464,16],[466,3,466,10],[466,12,466,15],[468,3,468,10],[469,3,469,10],[470,3,470,10],[471,4,471,9],[438,3,438,16],[439,3,439,16],[444,3,444,10],[445,3,445,10],[446,3,446,10],[780,3,780,10],[507,7,507,11],[510,3,510,16],[511,3,511,16],[488,12,488,16],[483,7,483,11],[531,7,531,11],[534,3,534,16],[536,12,536,16],[538,3,538,10],[538,12,538,15],[540,3,540,10],[541,3,541,10],[542,3,542,10],[543,4,543,9],[678,3,678,16],[562,12,562,15],[564,3,564,10],[565,3,565,10]]}
[]
[null,{"$f":"D3","v":"HK-140002-VE"}]
[null,null,null,"HK-140002-VE",null,null,null,{"$f":"\"有用な技術の位置づけ：\"&VLOOKUP(D3,一覧表!$E:$G,3,FALSE)","v":"有用な技術の位置づけ：準推奨"},null,null,null,null,null,null,null,{"$f":"HYPERLINK(\"#一覧表!h\"&MATCH(D3,一覧表!E:E,0),\"一覧表に戻る\")","v":"一覧表に戻る"},1]
[null,null,null,{"$f":"\"（工種 ： \"&VLOOKUP(D3,一覧表!$E:$AE,25,FALSE)&\"－\"&VLOOKUP(D3,一覧表!$E:$AE,26,FALSE)&\"－\"&IF(VLOOKUP(D3,一覧表!$E:$AE,27,FALSE)=\"\",\"　　　　　\",VLOOKUP(D3,一覧表!$E:$AE,27,FALSE))&\"）\"","v":"（工種 ： 橋梁上部工－橋梁用伸縮継手装置設置工－　　　　　）"}]
[]
[null,null,null,{"$f":"VLOOKUP(D3,一覧表!$E:$L,2,FALSE)","v":"橋梁用埋設型排水桝"}]
[null,null,null,{"$f":"\"  副題 ： \"&VLOOKUP(D3,一覧表!$E:$AA,22,FALSE)","v":"  副題 ： ・上面+側面集水型「D3(ディースリー)パイプ」 ・側面集水型「ジョイントドレーン」"}]
[null,null,null,null,null,null,null,null,null,null,null,null,{"$f":"\"開発者名 ： \"&VLOOKUP(D3,一覧表!$E:$AA,23,FALSE)","v":"開発者名 ： 中大実業株式会社 西日本高速道路メンテナンス関西株式会社 "}]
[]
[null,null,null,"概要、新規性及び期待される効果等",null,null,null,null,null,null,null,null,"図表等"]
[]
[null,null,null,{"$f":"VLOOKUP(D3,一覧表!$E:$L,7,FALSE)","v":"本製品はコンクリート床版上の雨水を排水するための床版排水用の雨水桝です。 伸縮装置取り換え工事と同時に設置を行い、遊間を利用して排水する技術です。 コアドリルによる削孔作業が不要なため施工が早いのが最大の特徴です。"}]
[null,null,null,"活用の効果"]
[null,null,null,{"$f":"\"比較する従来技術 ： \"&VLOOKUP(D3,一覧表!$E:$L,8,FALSE)","v":"比較する従来技術 ： 溶融亜鉛メッキ製 水抜き管(床版を削孔して設置する場合)"}]
[null,null,null,"項目","申請情報",null,null,null,null,null,"評価結果\n（C：同程度）"]
[null,null,null,"経済性",{"$f":"IF(LEFT(VLOOKUP(概要版1!D3,一覧表!$E:$X,9,FALSE),2)=\"向上\",\"■\",\"□\")","v":"■"},{"$f":"IF(LEFT(VLOOKUP(概要版1!D3,一覧表!$E:$X,9,FALSE),2)=\"向上\",VLOOKUP(概要版1!D3,一覧表!$E:$X,9,FALSE),\"向上\")","v":"向上(17%)"},{"$f":"IF(VLOOKUP(概要版1!D3,一覧表!$E:$X,9,FALSE)=\"同程度\",\"■\",\"□\")","v":"□"},"同程度",{"$f":"IF(LEFT(VLOOKUP(概要版1!D3,一覧表!$E:$X,9,FALSE),2)=\"低下\",\"■\",\"□\")","v":"□"},{"$f":"IF(LEFT(VLOOKUP(概要版1!D3,一覧表!$E:$X,9,FALSE),2)=\"低下\",VLOOKUP(概要版1!D3,一覧表!$E:$X,9,FALSE),\"低下\")","v":"低下"},{"$f":"VLOOKUP(概要版1!D3,一覧表!$E:$X,15,FALSE)","v":"B"}]
[null,null,null,"工程",{"$f":"IF(LEFT(VLOOKUP(概要版1!D3,一覧表!$E:$X,10,FALSE),2)=\"短縮\",\"■\",\"□\")","v":"■"},{"$f":"IF(LEFT(VLOOKUP(概要版1!D3,一覧表!$E:$X,10,FALSE),2)=\"短縮\",VLOOKUP(概要版1!D3,一覧表!$E:$X,10,FALSE),\"短縮\")","v":"短縮(75%)"},{"$f":"IF(VLOOKUP(概要版1!D3,一覧表!$E:$X,10,FALSE)=\"同程度\",\"■\",\"□\")","v":"□"},"同程度",{"$f":"IF(LEFT(VLOOKUP(概要版1!D3,一覧表!$E:$X,10,FALSE),2)=\"増加\",\"■\",\"□\")","v":"□"},{"$f":"IF(LEFT(VLOOKUP(概要版1!D3,一覧表!$E:$X,10,FALSE),2)=\"増加\",VLOOKUP(概要版1!D3,一覧表!$E:$X,10,FALSE),\"増加\")","v":"増加"},{"$f":"VLOOKUP(概要版1!D3,一覧表!$E:$X,16,FALSE)","v":"B"}]
[null,null,null,"品質",{"$f":"IF(VLOOKUP(概要版1!D3,一覧表!$E:$X,11,FALSE)=\"向上\",\"■\",\"□\")","v":"□"},"向上",{"$f":"IF(VLOOKUP(概要版1!D3,一覧表!$E:$X,11,FALSE)=\"同程度\",\"■\",\"□\")","v":"■"},"同程度",{"$f":"IF(VLOOKUP(概要版1!D3,一覧表!$E:$X,11,FALSE)=\"低下\",\"■\",\"□\")","v":"□"},"低下",{"$f":"VLOOKUP(概要版1!D3,一覧表!$E:$X,17,FALSE)","v":"B"}]
[null,null,null,"安全性",{"$f":"IF(VLOOKUP(概要版1!D3,一覧表!$E:$X,12,FALSE)=\"向上\",\"■\",\"□\")","v":"□"},"向上",{"$f":"IF(VLOOKUP(概要版1!D3,一覧表!$E:$X,12,FALSE)=\"同程度\",\"■\",\"□\")","v":"■"},"同程度",{"$f":"IF(VLOOKUP(概要版1!D3,一覧表!$E:$X,12,FALSE)=\"低下\",\"■\",\"□\")","v":"□"},"低下",{"$f":"VLOOKUP(概要版1!D3,一覧表!$E:$X,18,FALSE)","v":"C"}]
[null,null,null,"施工性",{"$f":"IF(VLOOKUP(概要版1!D3,一覧表!$E:$X,13,FALSE)=\"向上\",\"■\",\"□\")","v":"■"},"向上",{"$f":"IF(VLOOKUP(概要版1!D3,一覧表!$E:$X,13,FALSE)=\"同程度\",\"■\",\"□\")","v":"□"},"同程度",{"$f":"IF(VLOOKUP(概要版1!D3,一覧表!$E:$X,13,FALSE)=\"低下\",\"■\",\"□\")","v":"□"},"低下",{"$f":"VLOOKUP(概要版1!D3,一覧表!$E:$X,19,FALSE)","v":"B"}]
{"$rows_left_out":986}