{"text_format":"1","workbook":"xlsx","n_sheets":3,"sheets":["はじめに","一覧表","概要版1"],"not_rendered":{"charts":0,"images":102,"macros":1,"external_links":0,"defined_names":3,"comments":0,"pivot_tables":0},"unopened":[],"bounds":{"document_bytes":16777216,"sheet_cells":100000,"rows_first":2000,"rows_last":500,"rows_between":2000,"halvings":0,"cell_chars":16384,"cell_head_chars":4096},"cells_cut":0,"cells_raw":0,"read":"whole","date_system":"1900"}

{"sheet":"はじめに","index":0,"n_rows":0,"n_cols":0,"rows_kept":0,"cut":false,"hidden":false,"merged":[]}

{"sheet":"一覧表","index":1,"n_rows":46,"n_cols":31,"rows_kept":46,"cut":false,"hidden":false,"merged":[[0,13,0,15],[0,21,0,23],[2,10,3,10],[2,24,3,24],[1,1,1,10],[2,0,3,0],[2,1,2,3],[2,6,3,6],[2,8,3,8],[2,9,3,9],[2,7,3,7],[2,4,3,4],[2,5,3,5],[2,28,2,30],[2,27,3,27],[2,25,3,25],[2,26,3,26],[2,11,3,11],[2,12,2,17],[2,18,2,23]]}
["有用な新技術一覧表（推奨、準推奨、評価促進）（活用促進、設計比較対象、少実績優良）（令和 4年 1月 5日現在）　　　　　　　"]
[null,"　　　　　　 推奨技術、準推奨技術、評価促進技術 ,　　　　　　　　　　　　活用促進技術、設計比較対象技術、少実績優良技術"]
["№","工種",null,null,"登録番号","技術名称","技術の位置づけ","概要版","イントラ版","公開版","概要、新規性及び期待される効果等","比較する従来技術","申請情報",null,null,null,null,null,"評価結果　（Ｃ：同程度）",null,null,null,null,null,null,"副題","開発者名","登録番号","工種"]
[null,"レベル１","レベル２","レベル３",null,null,null,null,null,null,null,null,"経済性","工程","品質","安全性","施工性","環境","経済性","工程","品質","安全性","施工性","環境",null,null,null,null,"レベル１","レベル２","レベル３"]
[1,"橋梁上部工","橋梁用伸縮継手装置設置工",null,"HK-140002-VE","橋梁用埋設型排水桝","準推奨",{"$f":"HYPERLINK(\"#概要版1!b\"&MATCH(E5,概要版1!B:B,0),\"概要版\")","v":"概要版"},{"$f":"HYPERLINK(\"https://www.netis.mlit.go.jp/internalnetis/pubsearch/details?regNo=\"&LEFT(E5,9)&\"&TabType=2&nt=nt\",\"イントラ版\")","v":"イントラ版"},{"$f":"HYPERLINK(\"https://www.netis.mlit.go.jp/netis/pubsearch/details?regNo=\"&LEFT(E5,9)&\"&TabType=2&nt=nt\",\"公開版\")","v":"公開版"},"本製品はコンクリート床版上の雨水を排水するための床版排水用の雨水桝です。 伸縮装置取り換え工事と同時に設置を行い、遊間を利用して排水する技術です。 コアドリルによる削孔作業が不要なため施工が早いのが最大の特徴です。","溶融亜鉛メッキ製 水抜き管(床版を削孔して設置する場合)","向上(17%)","短縮(75%)","同程度","同程度","向上","同程度","B","B","B","C","B","C",null,"・上面+側面集水型「D3(ディースリー)パイプ」 ・側面集水型「ジョイントドレーン」","中大実業株式会社 西日本高速道路メンテナンス関西株式会社 ",{"$f":"HYPERLINK(\"http://www.netis.mlit.go.jp/NetisRev/Search/NtList.asp?registflg=true&qt=\"&E5&\"&hyouka=1&shinsei=1&search_type=1&TabType=2&Search=NewIndex&gcd=0&page=0&expnum=10\",E5)","v":"HK-140002-VE"},{"$f":"IF(B5=\"\",\"\",B5)","v":"橋梁上部工"},{"$f":"IF(C5=\"\",\"\",C5)","v":"橋梁用伸縮継手装置設置工"},{"$f":"IF(D5=\"\",\"\",D5)","v":""}]
[{"$f":"A5+1","v":2},"調査試験","構造物調査","非破壊試験、調査","KK-150069-VE","鋼製埋設部路面境界部の損傷判定、診断方法","準推奨",{"$f":"HYPERLINK(\"#概要版1!b\"&MATCH(E6,概要版1!B:B,0),\"概要版\")","v":"概要版"},"イントラ版","公開版","本技術は、パルス渦流法による迅速スクリーニング及び超音波表面SH波法による詳細検査を組合せ、効率的に路面境界部の損傷状況を可視化することを特徴とし、本技術の活用により品質、経済性、安全性、施工性の向上と工程の短縮が期待できる。","掘削による鋼製埋設物路面境界部の腐食状況検査","向上\n(56%)\n","短縮\n(81%)\n","向上","向上","向上","向上","B","B","B","B","B","A",null,"パルス渦流法、超音波法を併用した路面境界部(地際腐食)の非破壊検査システム","株式会社コベルコ科研、神鋼検査サービス株式会社",{"$f":"HYPERLINK(\"http://www.netis.mlit.go.jp/NetisRev/Search/NtList.asp?registflg=true&qt=\"&E6&\"&hyouka=1&shinsei=1&search_type=1&TabType=2&Search=NewIndex&gcd=0&page=0&expnum=10\",E6)","v":"KK-150069-VE"},{"$f":"IF(B6=\"\",\"\",B6)","v":"調査試験"},{"$f":"IF(C6=\"\",\"\",C6)","v":"構造物調査"},{"$f":"IF(D6=\"\",\"\",D6)","v":"非破壊試験、調査"}]
[{"$f":"A6+1","v":3},"調査試験","構造物調査","非破壊試験、調査","KT-130057-VE","支柱路面境界部検査システム","準推奨",{"$f":"HYPERLINK(\"#概要版1!b\"&MATCH(E7,概要版1!B:B,0),\"概要版\")","v":"概要版"},{"$f":"HYPERLINK(\"https://www.netis.mlit.go.jp/internalnetis/pubsearch/details?regNo=\"&LEFT(E7,9)&\"&TabType=2&nt=nt\",\"イントラ版\")","v":"イントラ版"},{"$f":"HYPERLINK(\"https://www.netis.mlit.go.jp/netis/pubsearch/details?regNo=\"&LEFT(E7,9)&\"&TabType=2&nt=nt\",\"公開版\")","v":"公開版"},"本技術は、複数のモードの超音波を使用して支柱路面境界部の検査を行う技術で、従来は、掘削後に目視および超音波厚さ計で行う検査で対応していた。本技術の活用により、掘削・復旧の工程がなくなるので、工期短縮、安全性の向上が図れます。","掘削後に目視および超音波厚さ計で行う検査","低下(-10%)","短縮(62%)","同程度","向上","向上","同程度","A","A","C","B","B","B",null,"超音波による路面境界部の非破壊検査システム「キズミー1」","株式会社リンク、MKエンジニアリング株式会社",{"$f":"HYPERLINK(\"http://www.netis.mlit.go.jp/NetisRev/Search/NtList.asp?registflg=true&qt=\"&E7&\"&hyouka=1&shinsei=1&search_type=1&TabType=2&Search=NewIndex&gcd=0&page=0&expnum=10\",E7)","v":"KT-130057-VE"},"調査試験","構造物調査","非破壊試験、調査"]
[{"$f":"A7+1","v":4},"コンクリート工","コンクリート工","鉄筋工","KT-170065-VE","錆転化処理剤・鉄筋防錆剤「ラストクエンチ」","活用促進",{"$f":"HYPERLINK(\"#概要版1!b\"&MATCH(E8,概要版1!B:B,0),\"概要版\")","v":"概要版"},{"$f":"HYPERLINK(\"https://www.netis.mlit.go.jp/internalnetis/pubsearch/details?regNo=\"&LEFT(E8,9)&\"&TabType=2&nt=nt\",\"イントラ版\")","v":"イントラ版"},{"$f":"HYPERLINK(\"https://www.netis.mlit.go.jp/netis/pubsearch/details?regNo=\"&LEFT(E8,9)&\"&TabType=2&nt=nt\",\"公開版\")","v":"公開版"},"本技術は、錆びた部分等の鉄筋の塗布型錆転化処理剤及び防錆剤(ラストクエンチ)で、従来は、鉄筋の錆をケレン作業で除去した後、防錆剤を塗布していた。本技術の活用により、ケレン作業等が省け工程が短縮し経済性が向上。複雑な配筋部等でも作業が可能で施工性も向上する。 ","錆びた鉄筋にケレン作業を施した後、防錆剤を塗布 ","向上\n(45%)\n","短縮\n(53%)\n","同程度","向上","向上","向上","B","B","B","B","A","B",null,"錆びた鉄筋に塗布するだけで鉄材や赤錆部分を安定して強固な黒皮被膜に転化し、さらに樹脂皮膜を形成することによって防錆効果を発揮。付着を妨げない錆転化型防錆剤","株式会社ノックス ",{"$f":"HYPERLINK(\"http://www.netis.mlit.go.jp/NetisRev/Search/NtList.asp?registflg=true&qt=\"&E8&\"&hyouka=1&shinsei=1&search_type=1&TabType=2&Search=NewIndex&gcd=0&page=0&expnum=10\",E8)","v":"KT-170065-VE"},{"$f":"IF(B8=\"\",\"\",B8)","v":"コンクリート工"},"コンクリート工","鉄筋工"]
[{"$f":"A8+1","v":5},"コンクリート工","コンクリート工","その他","KT-130065-VE","無機質けい酸塩系含浸材「ポルトガードプレクサス」","活用促進",{"$f":"HYPERLINK(\"#概要版1!b\"&MATCH(E9,概要版1!B:B,0),\"概要版\")","v":"概要版"},{"$f":"HYPERLINK(\"https://www.netis.mlit.go.jp/internalnetis/pubsearch/details?regNo=\"&LEFT(E9,9)&\"&TabType=2&nt=nt\",\"イントラ版\")","v":"イントラ版"},{"$f":"HYPERLINK(\"https://www.netis.mlit.go.jp/netis/pubsearch/details?regNo=\"&LEFT(E9,9)&\"&TabType=2&nt=nt\",\"公開版\")","v":"公開版"},"本技術はコンクリート表面保護に用いる散水養生不要のけい酸塩系含浸材であり、従来は散水養生を必要とするけい酸塩系含浸材で対応していた。本技術の活用によりカリウムの反応促進作用により散水養生が不要となるため、施工性の向上と経済性の向上が得られる。","散水養生を必要とするけい酸塩系含浸材\n","向上\n(30%)\n","短縮\n(67%)\n","同程度","同程度","向上","―","B","B","C","C","B","C",null,"散水養生が不要なけい酸塩系(ナトリウム・カリウム・リチウム混合型)含浸材","株式会社セントラルコンクリート、株式会社グリーンドゥ",{"$f":"HYPERLINK(\"http://www.netis.mlit.go.jp/NetisRev/Search/NtList.asp?registflg=true&qt=\"&E9&\"&hyouka=1&shinsei=1&search_type=1&TabType=2&Search=NewIndex&gcd=0&page=0&expnum=10\",E9)","v":"KT-130065-VE"},"コンクリート工","コンクリート工","その他"]
[6,"コンクリート工","コンクリート工","その他","CG-160013-VE","けい酸塩系表面含浸材CS-21ネオ","活用促進",{"$f":"HYPERLINK(\"#概要版1!b\"&MATCH(E10,概要版1!B:B,0),\"概要版\")","v":"概要版"},"イントラ版","公開版","新設コンクリート構造物の表面保護に最適で、施工性が良好な反応型けい酸塩系表面含浸材。施工は清掃後の表面に材料を1回塗布のみで散水は不要。継続的な微細空隙の充填効果により、かぶりを健全に保ち鋼材腐食を抑制。更なる品質向上、耐久性向上、長寿命化に寄与する。 ","表面含浸工法(反応型けい酸塩系表面含浸工法)","向上\n(59%)\n","短縮\n(67%)\n","向上","向上","向上","同程度","B","B","C","C","B","C",null,"新設コンクリート構造物の表面保護","株式会社アストン","CG-160013-VE","コンクリート工","コンクリート工","その他"]
[7,"コンクリート工","その他",null,"CB-130007-VE","ひび割れ補修浸透性エポキシ樹脂塗布工法","活用促進",{"$f":"HYPERLINK(\"#概要版1!b\"&MATCH(E11,概要版1!B:B,0),\"概要版\")","v":"概要版"},"イントラ版","公開版","ひび割れの奥まで補修する際に低圧注入器具を用いて補修材を注入していたのに対し、塗布だけでひび割れに補修材が浸透する工法です。 浸透性エポキシ樹脂接着剤「アルファテック388」を繰り返し塗布することで毛細管現象によってひび割れ内部にまで浸透します。","低圧注入工法 ","向上\n(53%)\n","短縮\n(75%)\n","向上","同程度","向上","向上","B","B","C","C","B","B",null,"塗布・浸透型ひび割れ補修材アルファテック388","中日本高速技術マーケティング株式会社 アルファ工業株式会社","CB-130007-VE",{"$f":"IF(B11=\"\",\"\",B11)","v":"コンクリート工"},{"$f":"IF(C11=\"\",\"\",C11)","v":"その他"},{"$f":"IF(D11=\"\",\"\",D11)","v":""}]
[8,"道路維持修繕工","橋梁補修補強工","断面修復工","QS-150017-VR","コンクリート構造物の断面修復材料「ゴムラテシリーズ」","活用促進",{"$f":"HYPERLINK(\"#概要版1!b\"&MATCH(E12,概要版1!B:B,0),\"概要版\")","v":"概要版"},{"$f":"HYPERLINK(\"https://www.netis.mlit.go.jp/internalnetis/pubsearch/details?regNo=\"&LEFT(E12,9)&\"&TabType=2&nt=nt\",\"イントラ版\")","v":"イントラ版"},{"$f":"HYPERLINK(\"https://www.netis.mlit.go.jp/netis/pubsearch/details?regNo=\"&LEFT(E12,9)&\"&TabType=2&nt=nt\",\"公開版\")","v":"公開版"},"超速硬ポリマーセメントモルタルまたはコンクリートにより、劣化損傷したコンクリート構造物の断面修復を行う技術で、従来は、超速硬コンクリートで対応していた。本技術の活用により、乾燥収縮が小さく、付着性・耐久性に優れた断面修復が可能である。","超速硬コンクリート","向上\n(37%)\n","短縮\n(33%)\n","向上","同程度","向上","向上","B","B","B","C","B","B",null,"プレミックス型超速硬ポリマーセメントモルタル・コンクリート","太平洋マテリアル株式会社 ","QS-150017-VR",{"$f":"IF(B12=\"\",\"\",B12)","v":"道路維持修繕工"},"橋梁補修補強工","断面修復工"]
[9,"道路維持修繕工","橋梁補修補強工","表面保護工　","CB-120013-VR","ハイブリッド形表面被覆材アロンブルコートZ-X、Z-Y工法　","活用促進",{"$f":"HYPERLINK(\"#概要版1!b\"&MATCH(E13,概要版1!B:B,0),\"概要版\")","v":"概要版"},"イントラ版","公開版","従来主流のコンクリート表面保護工は、エポキシ樹脂系材料であるが紫外線劣化により割れ剥がれが多く発生している。本工法は、コスト縮減・工程短縮・品質向上・施工性等に着目し開発した材料(セメント系無機質硬化材を主とし、アクリルゴムを混合)を用いる新工法である。 ","エポキシ樹脂系表面被覆材を用いた剥落防止工法","向上\n(8%)\n","短縮\n(20%)\n","向上","向上","向上","向上","B","B","B","C","B","B",null,"本工法は、工程短縮・品質向上・施工性にこだわって開発した材料(セメント系無機質硬化剤を主とし、アクリルゴムを混合)を用いる、コンクリート表面保護工法の新工法。","東亞合成株式会社、株式会社駒井ハルテック","CB-120013-VR","道路維持修繕工","橋梁補修補強工","表面保護工　"]
[10,"道路維持修繕工","橋梁補修補強工","表面保護工","KT-130009-VR","シリケートガード","活用促進",{"$f":"HYPERLINK(\"#概要版1!b\"&MATCH(E14,概要版1!B:B,0),\"概要版\")","v":"概要版"},"イントラ版","公開版","本技術は、施工時に反応促進剤を混合する2液性のけい酸塩系表面含浸材で、従来は1液性のけい酸塩系表面含浸材で対応していた。本技術の活用により、1回の塗布回数で施工できるため、施工性が良くなり、工期の短縮、経済性の向上が図れる。 ","1液性のけい酸塩系表面含浸材","向上\n(50%)\n","短縮\n(25%)\n","向上","同程度","向上","同程度","B","B","B","C","B","C",null,"コンクリート表面の緻密化により劣化を抑制し耐摩耗性を向上させるけい酸塩系表面含浸材","ショーボンド建設株式会社 , 有限会社シモダ技術研究所 ","KT-130009-VR","道路維持修繕工","橋梁補修補強工","表面保護工"]
[11,"道路維持修繕工","橋梁補修補強工","表面保護工","KT-120082-VR","ワンステップガード工法","活用促進",{"$f":"HYPERLINK(\"#概要版1!b\"&MATCH(E15,概要版1!B:B,0),\"概要版\")","v":"概要版"},"イントラ版","公開版","本技術は、特殊有機短繊維を混合したアクリル樹脂を塗布する方式のコンクリート片はく落防止対策工法で、従来は繊維シート接着工法で対応していた。本技術の活用により、シート接着工程が削減ができるので、工程の短縮、経済性の向上が図れる。","繊維シート接着工法 ","向上\n(28%)\n","短縮\n(58%)\n","同程度","同程度","同程度","向上","B","B","C","B","B","C",null,"短繊維混合樹脂によるコンクリート片はく落防止対策工法","電気化学工業株式会社 ","KT-120082-VR",{"$f":"IF(B15=\"\",\"\",B15)","v":"道路維持修繕工"},"橋梁補修補強工","表面保護工"]
[12,"道路維持修繕工","橋梁補修補強工","新素材繊維接着工　","CG-120025-VE","超薄膜スケルトンはく落防災コーティング","活用促進",{"$f":"HYPERLINK(\"#概要版1!b\"&MATCH(E16,概要版1!B:B,0),\"概要版\")","v":"概要版"},"イントラ版","公開版","透明特殊コーティング材とガラス連続繊維シートの含浸接着による、透けて見えるコンクリート構造物のはく落防止機能付き表面保護工法(繊維シートを使用しない場合は小片はく落防止機能)。塗膜の超薄膜化によってコーティング材の使用量を抑え経済性の向上を果たした。","ビニロン繊維シート工法","向上\n(4%)\n","短縮\n(33%)\n","向上","同程度","向上","向上","B","B","B","C","B","C",null,"透明特殊コーティング材とガラス連続繊維シートの含浸接着による、透けて見えるコンクリート構造物のはく落防止機能(繊維シートを使用しない場合は小片はく落防止機能)付き表面保護工法","株式会社エムビーエス","CG-120025-VE",{"$f":"IF(B16=\"\",\"\",B16)","v":"道路維持修繕工"},"橋梁補修補強工","新素材繊維接着工　"]
[13,"道路維持修繕工","橋梁補修補強工","防食対策工","KT-150081-VR","EPP(エコ・ペイント・ピーリング)工法","活用促進",{"$f":"HYPERLINK(\"#概要版1!b\"&MATCH(E17,概要版1!B:B,0),\"概要版\")","v":"概要版"},"イントラ版","公開版","本技術は、水性剥離剤を、橋梁などの塗膜に塗布することで、塗膜を浮き上がらせ除去する工法です。従来はブラスト工法を用いていました。本技術の活用により、塗膜除去時の粉塵と騒音の発生を防止できます。塗膜に有害物質を含む場合は特に有効です。 ","ブラスト工法 ","向上\n(48%)\n","短縮\n(43%)\n","低下","向上","同程度","向上","B","B","C","B","B","B",null,"水性塗膜剥離剤による塗膜の剥離工法","JFEエンジニアリング株式会社 ","KT-150081-VR","道路維持修繕工","橋梁補修補強工","防食対策工"]
[14,"道路維持修繕工","橋梁補修補強工","防食対策工","QS-150032-VE","循環式ハイブリッドブラストシステム","活用促進",{"$f":"HYPERLINK(\"#概要版1!b\"&MATCH(E18,概要版1!B:B,0),\"概要版\")","v":"概要版"},"イントラ版","公開版","橋梁補修補強工等において、鋼構造物の素地調整(1種ケレン)やコンクリート劣化部のチッピングを行う循環式機能付ブラスト工法で、従来は、エアーブラストで対応していた。本技術の活用により、ケレンかすから研削材を吸引再利用できるため、産業廃棄物を削減できる。 ","エアーブラスト(加圧式) ","向上\n(24%)\n","短縮\n(29%)\n","同程度","同程度","向上","向上","B","C","C","C","B","B",null,"研削材の再利用および設備の車載対応が可能なブラスト工法","株式会社イヤマトータルブリッジサポート","QS-150032-VE","道路維持修繕工","橋梁補修補強工","防食対策工"]
[15,"道路維持修繕工","橋梁補修補強工","防食対策工","HK-160021-VE","ECO-SCOP工法","活用促進",{"$f":"HYPERLINK(\"#概要版1!b\"&MATCH(E19,概要版1!B:B,0),\"概要版\")","v":"概要版"},{"$f":"HYPERLINK(\"https://www.netis.mlit.go.jp/internalnetis/pubsearch/details?regNo=\"&LEFT(E19,9)&\"&TabType=2&nt=nt\",\"イントラ版\")","v":"イントラ版"},{"$f":"HYPERLINK(\"https://www.netis.mlit.go.jp/netis/pubsearch/details?regNo=\"&LEFT(E19,9)&\"&TabType=2&nt=nt\",\"公開版\")","v":"公開版"},"分析用途の塗膜採取の従来技術は、素地調整2種が用いられているが、本技術の採取用具を用いることで、塗膜の採取コスト、作業工程と日数を各段に低減し、塗膜に含む有害物質から作業員の安全と周辺環境の汚染および二次汚染廃棄物の発生が防止できる。 ","素地調整2種 ","向上\n(59%)\n","短縮\n(82%)\n","向上","向上","向上","向上","B","B","C","B","B","B",null,"分析用途の塗膜採取及び回収方法","防食塗装研究所 ",{"$f":"HYPERLINK(\"http://www.netis.mlit.go.jp/NetisRev/Search/NtList.asp?registflg=true&qt=\"&E19&\"&hyouka=1&shinsei=1&search_type=1&TabType=2&Search=NewIndex&gcd=0&page=0&expnum=10\",E19)","v":"HK-160021-VE"},{"$f":"IF(B19=\"\",\"\",B19)","v":"道路維持修繕工"},{"$f":"IF(C19=\"\",\"\",C19)","v":"橋梁補修補強工"},{"$f":"IF(D19=\"\",\"\",D19)","v":"防食対策工"}]
[16,"道路維持修繕工","橋梁補修補強工","その他","KT-120008-VE","コンパクト ストッパー (KCS)","活用促進",{"$f":"HYPERLINK(\"#概要版1!b\"&MATCH(E20,概要版1!B:B,0),\"概要版\")","v":"概要版"},"イントラ版","公開版","本技術は水平2方向及び上向き(上揚力)の地震力に抵抗する緩衝ゴム付き変位制限装置であり、従来は鋼製ブラケットによる変位制限装置により対応していた。本技術の活用により、上向き地震力に抵抗可能な構造としたことにより、地震時における品質の向上となる。 ","鋼製ブラケットによる変位制限装置。","向上\n(5%)\n","短縮\n(4%)\n","向上","同程度","向上","同程度","B","B","B","C","B","C",null,"橋梁用の上揚力対応型水平ストッパー","株式会社川金コアテック","KT-120008-VE",{"$f":"IF(B20=\"\",\"\",B20)","v":"道路維持修繕工"},{"$f":"IF(C20=\"\",\"\",C20)","v":"橋梁補修補強工"},{"$f":"IF(D20=\"\",\"\",D20)","v":"その他"}]
[17,"道路維持修繕工","橋梁補修補強工","その他","SK-140006-VR","コンクリート剥落防止対策ネット工法","活用促進",{"$f":"HYPERLINK(\"#概要版1!b\"&MATCH(E21,概要版1!B:B,0),\"概要版\")","v":"概要版"},"イントラ版","公開版","本技術は、コンクリート片のはく落防止対策ネット工法で、従来のはつり・断面修復工法に比べ、本技術の活用により短期間で経済的に剥落防止が可能となり、施工後にはひび割れ等の目視観察ができる他、容易に部分補修が図れます。","はつり工+断面修復工法 ","向上\n(96%)\n","短縮\n(80%)\n","同程度","同程度","向上","向上","B","B","C","C","B","B",null,"メッシュシート(スマートメッシュ)によるコンクリート片の剥落防止対策工法","西日本高速道路エンジニアリング四国株式会社、株式会社西宮産業、有限会社マサクリーン","SK-140006-VR","道路維持修繕工","橋梁補修補強工","その他"]
[18,"道路維持修繕工","トンネル補修補強工","漏水対策工","KK-120043-VE","アーチ・ドレン工法","活用促進",{"$f":"HYPERLINK(\"#概要版1!b\"&MATCH(E22,概要版1!B:B,0),\"概要版\")","v":"概要版"},"イントラ版","公開版","本技術はプラスチック製の成型された耐衝撃性を有する樋を壁面にアンカーボルトで固定する線導水で従来はゴム系の導水材をコンクリートはつりして埋め込んで使用していた。本技術の活用により経済性、難燃性を期待できます。 ","線導水工（ゴム系）\n","向上\n(37%)\n","短縮\n(60%)\n","向上","同程度","向上","向上","B","B","B","C","B","B",null,"トンネル・ボックスカルバート・共同溝などの漏水対策工法","ニホン・ドレン株式会社\n","KK-120043-VE","道路維持修繕工","トンネル補修補強工","漏水対策工"]
[19,"道路維持修繕工","トンネル補修補強工","その他","KT-120036-VE","かため太郎","活用促進",{"$f":"HYPERLINK(\"#概要版1!b\"&MATCH(E23,概要版1!B:B,0),\"概要版\")","v":"概要版"},"イントラ版","公開版","本技術は、エポキシ樹脂スプレーによるコンクリート構造物の応急的補修材料で、従来は、ポリマーセメントはけ塗りで対応していた。本技術の活用により、従来技術の練混ぜやはけ塗りが不要なので、労務費減少と施工具経費がなくなることで、経済性の向上が期待できる。 ","ポリマーセメントはけ塗り","向上\n(39%)\n","短縮\n(83%)\n","向上","同程度","向上","同程度","B","A","C","C","B","C",null,"コンクリート構造物をワンプッシュで簡易に補修できる応急対策用スプレー缶補修材","東日本旅客鉄道株式会社、オバナヤ・セメンテックス株式会社","KT-120036-VE","道路維持修繕工","トンネル補修補強工","その他"]
[20,"道路維持修繕工","トンネル補修補強工","その他","KK-150047-VE","サイド・ドレンⅡ型工法","活用促進",{"$f":"HYPERLINK(\"#概要版1!b\"&MATCH(E24,概要版1!B:B,0),\"概要版\")","v":"概要版"},{"$f":"HYPERLINK(\"https://www.netis.mlit.go.jp/internalnetis/pubsearch/details?regNo=\"&LEFT(E24,9)&\"&TabType=2&nt=nt\",\"イントラ版\")","v":"イントラ版"},{"$f":"HYPERLINK(\"https://www.netis.mlit.go.jp/netis/pubsearch/details?regNo=\"&LEFT(E24,9)&\"&TabType=2&nt=nt\",\"公開版\")","v":"公開版"},"本技術はトンネルや橋梁上部からの漏水等を硬質塩ビ製の横引樋を使用して漏水を延長方向に導く漏水対策工であり、従来はコンクリートをVカットし導水ホースを入れモルタル補修していた。本技術の活用により周辺環境へ影響の抑制、経済性、品質の向上が期待できる。","Vカット工法","向上\n(43%)\n","短縮\n(4%)\n","向上","同程度","同程度","向上","B","B","B","C","C","B",null,"トンネル縦断方向、橋梁上部からの漏水対策工法","ニホン・ドレン株式会社","KK-150047-VE","道路維持修繕工","トンネル補修補強工","その他"]
[21,"道路維持修繕工","路面補修工","わだち掘れ補修工","HK-180003-VE","車載3Dスキャナを用いた舗装切削量等計算システム","活用促進",{"$f":"HYPERLINK(\"#概要版1!b\"&MATCH(E25,概要版1!B:B,0),\"概要版\")","v":"概要版"},{"$f":"HYPERLINK(\"https://www.netis.mlit.go.jp/internalnetis/pubsearch/details?regNo=\"&LEFT(E25,9)&\"&TabType=2&nt=nt\",\"イントラ版\")","v":"イントラ版"},{"$f":"HYPERLINK(\"https://www.netis.mlit.go.jp/netis/pubsearch/details?regNo=\"&LEFT(E25,9)&\"&TabType=2&nt=nt\",\"公開版\")","v":"公開版"},"横断プロフィールメータによる測定をMMS(モービル・マッピング・システム)に変更して、路面のわだち掘れを計測し、舗装の切削量、オーバーレイの合材量を計算する。 本技術の活用により、コスト縮減、工程短縮、安全性の向上が期待できる。","横断プロフィールメータによる計測","向上\n(8%)\n","短縮\n(66%)\n","向上","向上","向上","向上","B","A","B","B","A","B",null,"安全に配慮したMMSによるわだち掘れの計測","大陸建設株式会社","HK-180003-VE","道路維持修繕工","路面補修工","わだち掘れ補修工"]
[22,"橋梁上部工","鋼橋製作工",null,"CB-120011-VE","鋼構造物溶接止端部の疲労強度向上工法","活用促進",{"$f":"HYPERLINK(\"#概要版1!b\"&MATCH(E26,概要版1!B:B,0),\"概要版\")","v":"概要版"},{"$f":"HYPERLINK(\"https://www.netis.mlit.go.jp/internalnetis/pubsearch/details?regNo=\"&LEFT(E26,9)&\"&TabType=2&nt=nt\",\"イントラ版\")","v":"イントラ版"},{"$f":"HYPERLINK(\"https://www.netis.mlit.go.jp/netis/pubsearch/details?regNo=\"&LEFT(E26,9)&\"&TabType=2&nt=nt\",\"公開版\")","v":"公開版"},"本技術は、鋼構造物の溶接継手部を強化する技術であり、従来は溶接継手部の止端部をグラインダー仕上げで対応していた。本技術の活用により、溶接継手部が強化され鋼構造物の耐久性を向上させると共に、工期の短縮、作業者の作業負荷軽減が期待できる技術である。","グラインダー仕上げ工法\n","低下\n(-12%)\n","短縮\n(84%)\n","向上","向上","向上","向上","C","B","B","B","B","B",null,"既設橋溶接部に対するニードルピーニング工法","東洋精鋼株式会社\n","CB-120011-VE",{"$f":"IF(B26=\"\",\"\",B26)","v":"橋梁上部工"},{"$f":"IF(C26=\"\",\"\",C26)","v":"鋼橋製作工"},{"$f":"IF(D26=\"\",\"\",D26)","v":""}]
[23,"橋梁上部工","鋼橋製作工",null,"KT-160009-VR","耐疲労性向上溶接材料および施工法 ","活用促進",{"$f":"HYPERLINK(\"#概要版1!b\"&MATCH(E27,概要版1!B:B,0),\"概要版\")","v":"概要版"},{"$f":"HYPERLINK(\"https://www.netis.mlit.go.jp/internalnetis/pubsearch/details?regNo=\"&LEFT(E27,9)&\"&TabType=2&nt=nt\",\"イントラ版\")","v":"イントラ版"},{"$f":"HYPERLINK(\"https://www.netis.mlit.go.jp/netis/pubsearch/details?regNo=\"&LEFT(E27,9)&\"&TabType=2&nt=nt\",\"公開版\")","v":"公開版"},"本技術は溶接継手の疲労特性を向上させる技術で、従来はグラインダによる止端処理で対応していた。本技術の活用により構造物の耐久性が向上するとともに、処理速度向上による施工性および経済性の改善が図れます。","グラインダによる止端処理 ","向上\n(61%)\n","短縮\n(78%)\n","向上","同程度","向上","向上","B","B","B","C","B","B",null,"低変態温度溶接材料(LTT溶接材料)を用いた付加溶接施工法による疲労特性改善","株式会社 神戸製鋼所",{"$f":"HYPERLINK(\"http://www.netis.mlit.go.jp/NetisRev/Search/NtList.asp?registflg=true&qt=\"&E27&\"&hyouka=1&shinsei=1&search_type=1&TabType=2&Search=NewIndex&gcd=0&page=0&expnum=10\",E27)","v":"KT-160009-VR"},"橋梁上部工","鋼橋製作工",""]
[24,"橋梁上部工","橋梁塗装工（新設）",null,"TH-140010-VR","金属溶射の塗装工程省力化工法(SIC工法)","活用促進",{"$f":"HYPERLINK(\"#概要版1!b\"&MATCH(E28,概要版1!B:B,0),\"概要版\")","v":"概要版"},"イントラ版","公開版","本工法は金属溶射の塗装仕様であり、重防食塗装の技術である。封孔処理と塗装にSICシーラー(無溶剤1液型無機系封孔剤)を使用する。従来は有機溶剤系塗料で対応していた。本工法の活用により、工程の削減、耐久性の向上、環境負荷の低減が期待できる。 ","金属溶射を防食下地とした、有機溶剤系塗料による重防食塗装","向上\n(0.3%)\n","短縮\n(50%)\n","向上","同程度","向上","向上","B","B","B","B","B","B",null,"金属溶射の封孔処理で、完全封孔と着色の機能を持つ、多機能、省工程の重防食塗装。","株式会社中央コーポレーション、日本電通株式会社、株式会社永照","TH-140010-VR","橋梁上部工","橋梁塗装工（新設）"]
[25,"橋梁上部工","鋼橋床版工",null,"KT-160058-VE","KSボンド","活用促進",{"$f":"HYPERLINK(\"#概要版1!b\"&MATCH(E29,概要版1!B:B,0),\"概要版\")","v":"概要版"},{"$f":"HYPERLINK(\"https://www.netis.mlit.go.jp/internalnetis/pubsearch/details?regNo=\"&LEFT(E29,9)&\"&TabType=2&nt=nt\",\"イントラ版\")","v":"イントラ版"},{"$f":"HYPERLINK(\"https://www.netis.mlit.go.jp/netis/pubsearch/details?regNo=\"&LEFT(E29,9)&\"&TabType=2&nt=nt\",\"公開版\")","v":"公開版"},"本技術は、既設構造物とフレッシュコンクリート間に用いる土木用高耐久型エポキシ系接着剤で、従来はモルタル・コンクリート塗り継ぎ用エポキシ樹脂系接着剤で対応していた。本技術の活用により接着効果が確実に高くなるため、品質、安全性、経済性の向上が期待できる。","モルタル・コンクリート塗り継ぎ用エポキシ樹脂系接着剤 ","向上\n(2%)\n","同程度","向上","向上","同程度","同程度","B","C","B","C","B","C",null,"土木用高耐久型エポキシ系接着剤","鹿島道路株式会社 ",{"$f":"HYPERLINK(\"http://www.netis.mlit.go.jp/NetisRev/Search/NtList.asp?registflg=true&qt=\"&E29&\"&hyouka=1&shinsei=1&search_type=1&TabType=2&Search=NewIndex&gcd=0&page=0&expnum=10\",E29)","v":"KT-160058-VE"},{"$f":"B29","v":"橋梁上部工"},{"$f":"C29","v":"鋼橋床版工"}]
[26,"橋梁上部工","ポストテンション桁製作工","緊張工","QS-150030-VE","Gキャップ(注入口付)","活用促進",{"$f":"HYPERLINK(\"#概要版1!b\"&MATCH(E30,概要版1!B:B,0),\"概要版\")","v":"概要版"},"イントラ版","公開版","プレグラウトPC鋼材定着具の保護キャップに注入口および排気口を設けたもので、従来は予め保護キャップ内に樹脂を満たした後、定着具に取り付けていた。本技術の活用により、樹脂の後注入と確実な空気溜りの排除が可能となるため、施工性および品質の向上が期待できる。","一般的なグラウト保護キャップ ","向上\n(21%)\n","短縮\n(80%)\n","向上","同程度","向上","同程度","B","B","B","C","B","C",null,"プレグラウトPC鋼材定着具の注入口・排気口付き後注入式保護キャップ","株式会社片岡屋 ","QS-150030-VE",{"$f":"IF(B30=\"\",\"\",B30)","v":"橋梁上部工"},"ポストテンション桁製作工","緊張工"]
[27,"橋梁上部工","橋梁用伸縮継手装置設置工",null,"KT-120077-VE","ブロフジョイントSW型","活用促進",{"$f":"HYPERLINK(\"#概要版1!b\"&MATCH(E31,概要版1!B:B,0),\"概要版\")","v":"概要版"},"イントラ版","公開版","本技術は遊間形状を波形にした橋梁用伸縮継手装置で、従来はゴム製伸縮継手装置で対応していた。本技術の活用により、タイヤとの接触が点接触となるため、車両通過時の衝撃音が減少し品質が向上する。","ゴム製伸縮継手装置","向上\n(20%)\n","同程度","向上","同程度","同程度","向上","B","C","B","C","C","B",null,"耐久性・走行性・止水性を向上させた伸縮継手装置","東京ファブリック工業株式会社","KT-120077-VE",{"$f":"IF(B31=\"\",\"\",B31)","v":"橋梁上部工"},{"$f":"IF(C31=\"\",\"\",C31)","v":"橋梁用伸縮継手装置設置工"},{"$f":"IF(D31=\"\",\"\",D31)","v":""}]
[28,"橋梁上部工","その他",null,"TH-120010-VE","パワーダンパー","活用促進",{"$f":"HYPERLINK(\"#概要版1!b\"&MATCH(E32,概要版1!B:B,0),\"概要版\")","v":"概要版"},"イントラ版","公開版","本技術は地震力を低減させるシリンダ型粘性ダンパーです。本技術の活用により、橋脚基礎の補強を省略するとともに、橋脚の補強量を低減させることが可能となり、経済性が向上し、工程を短縮することができます。 ","橋脚基礎補強","向上\n(46%)\n","短縮\n(33%)\n","同程度","同程度","向上","同程度","B","B","B","C","B","C",null,"橋梁に用いる粘性型制震ダンパー","株式会社横河ブリッジ、　オックスジャッキ株式会社","TH-120010-VE","橋梁上部工","その他",""]
[29,"橋梁上部工","その他",null,"CB-120033-VE","FRP検査路","活用促進",{"$f":"HYPERLINK(\"#概要版1!b\"&MATCH(E33,概要版1!B:B,0),\"概要版\")","v":"概要版"},"イントラ版","公開版","FRP検査路は、腐食により保全のための点検ができない問題を解消し、点検中の転落などの不幸な事故を防止する、安心・安全で長持ちする技術です。 ","塩害地域の鋼製検査路(溶融亜鉛メッキ)","向上\n(53%)\n","短縮\n(40%)\n","同程度","向上","向上","同程度","B","B","B","B","B","C",null,"繊維強化プラスティックを用いた、軽量・耐食性に優れた検査路","宮地エンジニアリング株式会社、AGCマテックス株式会社","CB-120033-VE","橋梁上部工","その他",""]
[30,"調査試験","測量","その他","KT-130026-VE","快速深浅測量システム","活用促進",{"$f":"HYPERLINK(\"#概要版1!b\"&MATCH(E34,概要版1!B:B,0),\"概要版\")","v":"概要版"},"イントラ版","公開版","本技術は、2台のGPS受信機等と音響測深機を用いた深浅測量システムで、従来は、トータルステーションと音響測深機を用いた深浅測量で対応していた。本技術の活用により、測点毎のトータルステーションの操作が不要となり、工期短縮が図れる。 ","トータルステーションと音響測深機を用いた深浅測量","向上\n(43%)\n","短縮\n(33%)\n","同程度","同程度","向上","同程度","B","B","B","－","B","－",null,"GPS電波を受信できる場所はもちろんのこと、GPS電波を受信できない場所でも水底の形状を高精度に測量する深浅測量","株式会社CSS技術開発","KT-130026-VE",{"$f":"IF(B34=\"\",\"\",B34)","v":"調査試験"},{"$f":"IF(C34=\"\",\"\",C34)","v":"測量"},{"$f":"IF(D34=\"\",\"\",D34)","v":"その他"}]
[31,"調査試験","測量","その他","QS-160031-VE","無線遠隔操縦等の小型船舶による高精度深浅測量システム","活用促進",{"$f":"HYPERLINK(\"#概要版1!b\"&MATCH(E35,概要版1!B:B,0),\"概要版\")","v":"概要版"},"イントラ版","公開版","無線遠隔操縦等による小型船舶は小さな波の影響を受け動揺しやすい。従って、測深機のみを搭載しても、水深精度を著しく低下させる。開発システムは無人小型船舶に動揺センサを搭載し、リアルタイムに補正する音響測深システムである。","測量船による深浅測量","向上\n(9%)\n","短縮\n(18%)\n","向上","向上","向上","向上","B","B","B","B","B","B",null,"動揺センサー搭載によるリアルタイム補正","株式会社国際海洋開発、国立大学法人九州工業大学","QS-160031-VE","調査試験","測量","その他"]
[32,"調査試験","測量","その他","CG-180003-VE","マルチビーム測深機搭載の無人ボートによる深浅測量","活用促進",{"$f":"HYPERLINK(\"#概要版1!b\"&MATCH(E36,概要版1!B:B,0),\"概要版\")","v":"概要版"},{"$f":"HYPERLINK(\"https://www.netis.mlit.go.jp/internalnetis/pubsearch/details?regNo=\"&LEFT(E36,9)&\"&TabType=2&nt=nt\",\"イントラ版\")","v":"イントラ版"},{"$f":"HYPERLINK(\"https://www.netis.mlit.go.jp/netis/pubsearch/details?regNo=\"&LEFT(E36,9)&\"&TabType=2&nt=nt\",\"公開版\")","v":"公開版"},"本技術はマルチビーム音響測深機搭載の無人ボートを用いた水底地形測量で、従来はマルチビーム音響測深機搭載を有人船に搭載して対応していた。本技術の活用により有人船への機器の艤装が不要になり時間や人員が大幅に削減できる。","有人船(傭船)に搭載したマルチビーム音響測深機を用いた深浅測量","向上\n(47%)\n","短縮\n(8%)\n","同程度","向上","向上","向上","B","B","C","B","A","B",null,"自動航行機能を有した無人ボートに搭載されたマルチビーム測深を用いた海底地形3次元深浅測量システム","株式会社東陽テクニカ",{"$f":"HYPERLINK(\"http://www.netis.mlit.go.jp/NetisRev/Search/NtList.asp?registflg=true&qt=\"&E36&\"&hyouka=1&shinsei=1&search_type=1&TabType=2&Search=NewIndex&gcd=0&page=0&expnum=10\",E36)","v":"CG-180003-VE"},"調査試験","測量","その他"]
[33,"調査試験","地質調査","地下調査","HR-130013-VE","スケルカ・陥没防止技術(路面下空洞調査)","活用促進",{"$f":"HYPERLINK(\"#概要版1!b\"&MATCH(E37,概要版1!B:B,0),\"概要版\")","v":"概要版"},"イントラ版","公開版","道路等の表面下の空洞を探査車(SKELE-CAR)で調査する技術で、従来は、探査車(7CH)による一次調査+メッシュ調査で対応していた。本技術の活用により、メッシュ調査が不要になり経済性・施工性・安全性が向上し、工程が短縮される。","探査車(7CHアンテナ)による一次調査+ハンディ型地中レーダによるメッシュ調査","向上\n(20%)\n","短縮\n(33%)\n","向上","向上","向上","向上","A","A","A","B","A","B",null,"高速・高解像度3次元地中レーダ技術による路面下空洞調査技術","ジオ・サーチ株式会社","HR-130013-VE","調査試験","地質調査","地下調査"]
[34,"調査試験","構造物調査","非破壊試験、調査","CB-150004-VE","橋面舗装・床版上部非破壊調査システム(床版キャッチャー)","活用促進",{"$f":"HYPERLINK(\"#概要版1!b\"&MATCH(E38,概要版1!B:B,0),\"概要版\")","v":"概要版"},"イントラ版","公開版","本技術は、電磁波解析手法を改善した床版劣化調査技術であり、従来の電磁波調査は解析者の個人誤差を含むものであった。本技術の活用により、定量化された解析判断基準から、解析者によらず精度良く床版の損傷範囲を把握できる。","舗装路面の目視調査、地中レーダ調査(空洞調査) ","向上\n(81%)\n","短縮\n(35%)\n","向上","向上","向上","向上","B","B","C","B","B","B",null,"3次元電磁波技術の解析手法を改善した床版劣化調査技術","ニチレキ株式会社 ","CB-150004-VE",{"$f":"IF(B38=\"\",\"\",B38)","v":"調査試験"},"構造物調査","非破壊試験、調査"]
[35,"調査試験","構造物調査","非破壊試験、調査","KT-160111-VE","プロテスターTRシリーズ","活用促進",{"$f":"HYPERLINK(\"#概要版1!b\"&MATCH(E39,概要版1!B:B,0),\"概要版\")","v":"概要版"},{"$f":"HYPERLINK(\"https://www.netis.mlit.go.jp/internalnetis/pubsearch/details?regNo=\"&LEFT(E39,9)&\"&TabType=2&nt=nt\",\"イントラ版\")","v":"イントラ版"},{"$f":"HYPERLINK(\"https://www.netis.mlit.go.jp/netis/pubsearch/details?regNo=\"&LEFT(E39,9)&\"&TabType=2&nt=nt\",\"公開版\")","v":"公開版"},"本技術は、あと施工アンカーボルトの施工強度を人力で計測する引張荷重確認試験機であり、従来は油圧式アンカーボルト引張荷重検査器で対応していた。本技術の活用により、取付物を取り外さずに計測可能となり、工期短縮・省力化・省人化による経済性の向上が図れます。","油圧式アンカーボルト引張荷重検査器 ","向上\n(51%)\n","短縮\n(67%)\n","向上","同程度","向上","同程度","B","B","B","B","A","C",null,"あと施工アンカーボルト引張荷重確認試験機","株式会社トラスト",{"$f":"HYPERLINK(\"http://www.netis.mlit.go.jp/NetisRev/Search/NtList.asp?registflg=true&qt=\"&E39&\"&hyouka=1&shinsei=1&search_type=1&TabType=2&Search=NewIndex&gcd=0&page=0&expnum=10\",E39)","v":"KT-160111-VE"},{"$f":"IF(B39=\"\",\"\",B39)","v":"調査試験"},{"$f":"IF(C39=\"\",\"\",C39)","v":"構造物調査"},{"$f":"IF(D39=\"\",\"\",D39)","v":"非破壊試験、調査"}]
[36,"調査試験","構造物調査","非破壊試験、調査","KT-170007-VE","アンカーボルト引張荷重の一体型試験測定システム(テクノテスターシリーズ)","活用促進",{"$f":"HYPERLINK(\"#概要版1!b\"&MATCH(E40,概要版1!B:B,0),\"概要版\")","v":"概要版"},"イントラ版","公開版","本技術は一体型アンカーボルト引張荷重試験機で従来は油圧シリンダ、反力台などを用いたアンカーボルト引張荷重試験機で対応していた。本技術の活用により多くの引張試験を行う際の組立作業の軽減と、データ保存もできる効果により安全性の向上と工程の短縮が図れる。 ","油圧シリンダ、反力台などを用いたアンカーボルト引張荷重試験機","向上\n(33%)\n","短縮\n(50%)\n","向上","向上","同程度","同程度","B","B","B","C","B","C",null,"引張り試験からデータ管理まで簡便に行える一体型アンカーボルト引張荷重確認試験機","サンコーテクノ株式会社","KT-170007-VE","調査試験","構造物調査","非破壊試験、調査"]
[37,"調査試験","構造物調査","非破壊試験、調査","KK-130026-VE","走行型高速3Dトンネル点検システム MIMM(ミーム)","活用促進",{"$f":"HYPERLINK(\"#概要版1!b\"&MATCH(E41,概要版1!B:B,0),\"概要版\")","v":"概要版"},{"$f":"HYPERLINK(\"https://www.netis.mlit.go.jp/internalnetis/pubsearch/details?regNo=\"&LEFT(E41,9)&\"&TabType=2&nt=nt\",\"イントラ版\")","v":"イントラ版"},{"$f":"HYPERLINK(\"https://www.netis.mlit.go.jp/netis/pubsearch/details?regNo=\"&LEFT(E41,9)&\"&TabType=2&nt=nt\",\"公開版\")","v":"公開版"},"本技術は道路トンネル定期点検を車両の高速走行で覆工面カラー画像と3次元空間位置データを計測するシステムで、従来は近接目視点検で対応していた。本技術の活用により、経済性・安全性・点検精度の向上、効率化、正確・客観的な変状展開図作成が可能となる。","道路トンネル定期点検(応急措置含む)","向上\n(20%)\n","短縮\n(58%)\n","向上","向上","向上","向上","C","B","B","B","B","B",null,"点検時の交通規制が不要で、高速走行しながらトンネル覆工壁面カラー画像と高精度な三次元空間位置データを効率よく取得するシステム","計測検査株式会社、パシフィックコンサルタンツ株式会社",{"$f":"HYPERLINK(\"http://www.netis.mlit.go.jp/NetisRev/Search/NtList.asp?registflg=true&qt=\"&E41&\"&hyouka=1&shinsei=1&search_type=1&TabType=2&Search=NewIndex&gcd=0&page=0&expnum=10\",E41)","v":"KK-130026-VE"},{"$f":"IF(B41=\"\",\"\",B41)","v":"調査試験"},{"$f":"IF(C41=\"\",\"\",C41)","v":"構造物調査"},{"$f":"IF(D41=\"\",\"\",D41)","v":"非破壊試験、調査"}]
[38,"調査試験","構造物調査","非破壊試験、調査","KT-150087-VE","アンカープロチェッカー(APC)","活用促進",{"$f":"HYPERLINK(\"#概要版1!b\"&MATCH(E42,概要版1!B:B,0),\"概要版\")","v":"概要版"},{"$f":"HYPERLINK(\"https://www.netis.mlit.go.jp/internalnetis/pubsearch/details?regNo=\"&LEFT(E42,9)&\"&TabType=2&nt=nt\",\"イントラ版\")","v":"イントラ版"},{"$f":"HYPERLINK(\"https://www.netis.mlit.go.jp/netis/pubsearch/details?regNo=\"&LEFT(E42,9)&\"&TabType=2&nt=nt\",\"公開版\")","v":"公開版"},"本技術は、既設のあと施工アンカーボルトの施工強度を人力で検査できる引張荷重簡易検査器であり、従来は油圧式アンカーボルト引張荷重検査器で対応していた。本技術の活用により検査の工程の短縮と省力化が実現でき、経済性と工事の品質の向上が図れます。","油圧式アンカーボルト引張荷重検査器","向上\n(72%)\n","短縮\n(75%)\n","向上","同程度","向上","同程度","C","A","B","B","A","B",null,"アンカーボルト引張荷重簡易検査器","株式会社トラスト","KT-150087-VE","調査試験","構造物調査","非破壊試験、調査"]
[39,"調査試験","構造物調査","非破壊試験、調査","KT-150121-VE","鋼管柱路面境界部腐食診断装置 コロージョンドクター","活用促進",{"$f":"HYPERLINK(\"#概要版1!b\"&MATCH(E43,概要版1!B:B,0),\"概要版\")","v":"概要版"},{"$f":"HYPERLINK(\"https://www.netis.mlit.go.jp/internalnetis/pubsearch/details?regNo=\"&LEFT(E43,9)&\"&TabType=2&nt=nt\",\"イントラ版\")","v":"イントラ版"},{"$f":"HYPERLINK(\"https://www.netis.mlit.go.jp/netis/pubsearch/details?regNo=\"&LEFT(E43,9)&\"&TabType=2&nt=nt\",\"公開版\")","v":"公開版"},"本技術は、道路標識柱等、鋼管柱路面境界下の健全・腐食度合を超音波を使った非破壊で診断する技術で、従来は埋設部を掘削した後目視および超音波板厚計による腐食診断であった。本技術の活用により、掘削・復旧作業がなくなるので、経済性および施工性の向上が図れる。","近接目視と掘削後超音波板厚計による鋼管柱路面境界部腐食診断","向上\n(53%)\n","短縮\n(80%)\n","同程度","向上","向上","向上","B","A","C","B","B","A",null,"非破壊検査による超音波式鋼管柱路面境界部腐食診断装置","株式会社ジオファイブ","KT-150121-VE","調査試験","構造物調査","非破壊試験、調査"]
[40,"調査試験","構造物調査","その他","SK-160016-VE","浮き足場式工法(ゼニフロートX) ","活用促進",{"$f":"HYPERLINK(\"#概要版1!b\"&MATCH(E44,概要版1!B:B,0),\"概要版\")","v":"概要版"},{"$f":"HYPERLINK(\"https://www.netis.mlit.go.jp/internalnetis/pubsearch/details?regNo=\"&LEFT(E44,9)&\"&TabType=2&nt=nt\",\"イントラ版\")","v":"イントラ版"},{"$f":"HYPERLINK(\"https://www.netis.mlit.go.jp/netis/pubsearch/details?regNo=\"&LEFT(E44,9)&\"&TabType=2&nt=nt\",\"公開版\")","v":"公開版"},"本技術は、ポリエチレン製の浮き足場(ゼニフロートX)を用途に合わせて組合せ、桁下高が水面から5m以内の橋梁点検・調査および補修工事等を行うものであり、従来は鋼製台船等で対応していた。本技術の採用により、作業の省力化および経済性の向上が期待できる。","鋼製台船による橋梁点検・調査および補修工事等","向上\n(37%)\n","短縮\n(25%)\n","同程度","向上","向上","同程度","B","B","ー","B","B","C",null,"浮き足場を用いた橋梁等の点検・調査・補修技術","ゼニヤ海洋サービス株式会社","SK-160016-VE","調査試験","構造物調査","その他"]
[41,"調査試験","構造物調査","その他","HK-150004-VE","Single i工法(シングルi工法)","活用促進",{"$f":"HYPERLINK(\"#概要版1!b\"&MATCH(E45,概要版1!B:B,0),\"概要版\")","v":"概要版"},{"$f":"HYPERLINK(\"https://www.netis.mlit.go.jp/internalnetis/pubsearch/details?regNo=\"&LEFT(E45,9)&\"&TabType=2&nt=nt\",\"イントラ版\")","v":"イントラ版"},{"$f":"HYPERLINK(\"https://www.netis.mlit.go.jp/netis/pubsearch/details?regNo=\"&LEFT(E45,9)&\"&TabType=2&nt=nt\",\"公開版\")","v":"公開版"},"1.コンクリート内部に発生したひび割れや空洞、剥離等を正確にその場で検査できる 2.穿孔穴から特殊カラー樹脂を注入することで、同一箇所から再穿孔しても角欠けが起きず内視鏡で動画等の正確なデータを取得し、1枚の写真化にしてコンクリート色と樹脂の色分けができる","直径100mmコアによる調査法(蛍光エポキシ樹脂真空含浸法)","向上\n(47%)\n","短縮\n(43%)\n","同程度","同程度","向上","同程度","B","B","A","B","A","B",null,"コンクリート内部に発生したひび割れや空洞を正確に検査しその場で確認できるシステム","株式会社ティ・エス・プランニング/一般社団法人日本建設機械施工協会 施工技術総合研究所","HK-150004-VE","調査試験","構造物調査","その他"]
[42,"調査試験","分析・予測システム",null,"CG-170010-VE","道路管理画像を用いた路面評価システム","活用促進",{"$f":"HYPERLINK(\"#概要版1!b\"&MATCH(E46,概要版1!B:B,0),\"概要版\")","v":"概要版"},"イントラ版","公開版","路面静止画を利用した技術者判読に、AIを活用した自動判読を取り入れ「ひび割れ率」を効率的に算出する技術です。さらに、IRI値・ひび割れ率・わだち掘れレベルの3指標で評価する「簡易PMS」の活用で、損傷分布状況の把握や補修箇所の選定等が容易にできる技術です。 ","路面のひび割れ測定方法(スケッチ法)を用いた路面管理 ","向上\n(93%)\n","短縮\n(82%)\n","向上","向上","向上","向上","B","B","B","B","B","B",null,"画像を利用した「ひび割れ率 」の算出にAIを活用した自動判読を取り入れ、路面評価等を効率化する「簡易PMS」を取り入れた路面評価システム","西日本高速道路エンジニアリング中国株式会社 ","CG-170010-VE",{"$f":"IF(B46=\"\",\"\",B46)","v":"調査試験"},{"$f":"IF(C46=\"\",\"\",C46)","v":"分析・予測システム"},{"$f":"IF(D46=\"\",\"\",D46)","v":""}]

{"sheet":"概要版1","index":2,"n_rows":1006,"n_cols":17,"rows_kept":1006,"cut":false,"hidden":false,"merged":[[962,1,983,1],[703,3,703,16],[890,1,911,1],[900,3,900,10],[901,3,901,10],[902,3,902,10],[968,12,968,16],[434,1,455,1],[924,3,924,10],[925,3,925,10],[926,3,926,10],[927,4,927,9],[939,7,939,11],[942,3,942,16],[943,3,943,16],[946,3,946,10],[946,12,946,15],[948,3,948,10],[949,3,949,10],[950,3,950,10],[614,3,614,10],[615,4,615,9],[566,3,566,10],[567,4,567,9],[866,1,887,1],[867,7,867,11],[870,3,870,16],[871,3,871,16],[914,1,935,1],[915,7,915,11],[918,3,918,16],[919,3,919,16],[922,3,922,10],[922,12,922,15],[423,4,423,9],[613,3,613,10],[637,3,637,10],[638,3,638,10],[999,4,999,9],[975,4,975,9],[634,3,634,10],[634,12,634,15],[636,3,636,10],[726,3,726,16],[606,3,606,16],[607,3,607,16],[610,3,610,10],[610,12,610,15],[612,3,612,10],[492,3,492,10],[493,3,493,10],[903,4,903,9],[775,3,775,16],[994,12,994,15],[996,3,996,10],[997,3,997,10],[998,3,998,10],[973,3,973,10],[319,3,319,16],[322,3,322,10],[396,3,396,10],[397,3,397,10],[398,3,398,10],[391,3,391,16],[348,3,348,10],[349,3,349,10],[350,3,350,10],[351,4,351,9],[392,12,392,17],[394,3,394,10],[394,12,394,15],[339,7,339,11],[342,3,342,16],[343,3,343,16],[346,3,346,10],[346,12,346,15],[320,12,320,16],[363,7,363,11],[366,3,366,16],[367,3,367,16],[399,4,399,9],[390,3,390,16],[414,3,414,16],[415,3,415,16],[418,3,418,10],[418,12,418,15],[420,3,420,10],[421,3,421,10],[422,3,422,10],[174,3,174,16],[318,3,318,16],[267,7,267,11],[266,1,287,1],[242,1,263,1],[180,3,180,10],[181,3,181,10],[270,3,270,16],[271,3,271,16],[274,3,274,10],[298,3,298,10],[298,12,298,15],[300,3,300,10],[274,12,274,15],[302,3,302,10],[303,4,303,9],[175,3,175,16],[178,12,178,15],[290,1,311,1],[291,7,291,11],[294,3,294,16],[295,3,295,16],[974,3,974,10],[708,3,708,10],[709,3,709,10],[710,3,710,10],[970,12,970,15],[972,3,972,10],[728,12,728,16],[874,3,874,10],[874,12,874,15],[876,3,876,10],[877,3,877,10],[878,3,878,10],[879,4,879,9],[891,7,891,11],[894,3,894,16],[895,3,895,16],[898,3,898,10],[778,3,778,10],[963,7,963,11],[966,3,966,16],[967,3,967,16],[970,3,970,10],[951,4,951,9],[778,12,778,15],[706,3,706,10],[706,12,706,15],[370,3,370,10],[370,12,370,15],[372,3,372,10],[373,3,373,10],[314,1,335,1],[315,7,315,11],[386,1,407,1],[322,12,322,15],[324,3,324,10],[325,3,325,10],[326,3,326,10],[327,4,327,9],[362,1,383,1],[602,1,623,1],[530,1,551,1],[554,1,575,1],[626,1,647,1],[506,1,527,1],[674,1,695,1],[650,1,671,1],[338,1,359,1],[516,3,516,10],[517,3,517,10],[518,3,518,10],[898,12,898,15],[374,3,374,10],[375,4,375,9],[387,7,387,11],[830,3,830,10],[831,4,831,9],[699,7,699,11],[702,3,702,16],[687,4,687,9],[651,7,651,11],[639,4,639,9],[682,3,682,10],[682,12,682,15],[711,4,711,9],[684,3,684,10],[685,3,685,10],[686,3,686,10],[850,12,850,15],[519,4,519,9],[663,4,663,9],[654,3,654,16],[675,7,675,11],[560,12,560,16],[630,3,630,16],[658,12,658,15],[660,3,660,10],[661,3,661,10],[662,3,662,10],[627,7,627,11],[655,3,655,16],[658,3,658,10],[603,7,603,11],[562,3,562,10],[11,3,11,10],[12,3,12,10],[13,3,13,10],[14,4,14,9],[7,12,7,16],[20,13,21,15],[1,1,22,1],[2,7,2,11],[5,3,5,16],[9,3,9,10],[9,12,9,15],[57,3,57,10],[62,4,62,9],[50,7,50,11],[53,3,53,16],[54,3,54,16],[25,1,46,1],[26,7,26,11],[29,3,29,16],[30,3,30,16],[33,3,33,10],[33,12,33,15],[35,3,35,10],[36,3,36,10],[37,3,37,10],[38,4,38,9],[49,1,70,1],[59,3,59,10],[60,3,60,10],[61,3,61,10],[57,12,57,15],[97,1,118,1],[98,7,98,11],[101,3,101,16],[102,3,102,16],[105,3,105,10],[105,12,105,15],[107,3,107,10],[108,3,108,10],[109,3,109,10],[110,4,110,9],[121,1,142,1],[122,7,122,11],[125,3,125,16],[126,3,126,16],[156,3,156,10],[218,1,239,1],[219,7,219,11],[222,3,222,16],[226,3,226,10],[226,12,226,15],[228,3,228,10],[229,3,229,10],[230,3,230,10],[231,4,231,9],[194,1,215,1],[195,7,195,11],[198,3,198,16],[199,3,199,16],[202,3,202,10],[202,12,202,15],[204,3,204,10],[205,3,205,10],[206,3,206,10],[178,3,178,10],[842,1,863,1],[730,3,730,10],[730,12,730,15],[732,3,732,10],[733,3,733,10],[734,3,734,10],[735,4,735,9],[852,3,852,10],[853,3,853,10],[854,3,854,10],[855,4,855,9],[818,1,839,1],[819,7,819,11],[822,3,822,16],[823,3,823,16],[826,3,826,10],[826,12,826,15],[828,3,828,10],[829,3,829,10],[722,1,743,1],[723,7,723,11],[781,3,781,10],[782,3,782,10],[783,4,783,9],[938,1,959,1],[986,1,1007,1],[987,7,987,11],[990,3,990,16],[991,3,991,16],[994,3,994,10],[698,1,719,1],[843,7,843,11],[846,3,846,16],[847,3,847,16],[850,3,850,10],[746,1,767,1],[747,7,747,11],[750,3,750,16],[751,3,751,16],[754,3,754,10],[754,12,754,15],[756,3,756,10],[757,3,757,10],[758,3,758,10],[759,4,759,9],[770,1,791,1],[771,7,771,11],[774,3,774,16],[145,1,166,1],[514,3,514,10],[514,12,514,15],[158,4,158,9],[146,7,146,11],[149,3,149,16],[151,12,151,16],[490,12,490,15],[435,7,435,11],[494,3,494,10],[495,4,495,9],[207,4,207,9],[224,12,224,16],[276,3,276,10],[277,3,277,10],[278,3,278,10],[279,4,279,9],[301,3,301,10],[243,7,243,11],[246,3,246,16],[442,3,442,10],[442,12,442,15],[170,1,191,1],[171,7,171,11],[86,4,86,9],[247,3,247,16],[250,3,250,10],[250,12,250,15],[252,3,252,10],[253,3,253,10],[254,3,254,10],[255,4,255,9],[81,3,81,10],[81,12,81,15],[83,3,83,10],[84,3,84,10],[129,3,129,10],[129,12,129,15],[131,3,131,10],[132,3,132,10],[133,3,133,10],[150,3,150,16],[153,3,153,10],[153,12,153,15],[155,3,155,10],[157,3,157,10],[182,3,182,10],[183,4,183,9],[74,7,74,11],[77,3,77,16],[78,3,78,16],[73,1,94,1],[578,1,599,1],[579,7,579,11],[582,3,582,16],[586,3,586,10],[586,12,586,15],[588,3,588,10],[589,3,589,10],[590,3,590,10],[591,4,591,9],[555,7,555,11],[558,3,558,16],[447,4,447,9],[410,1,431,1],[411,7,411,11],[440,12,440,16],[134,4,134,9],[490,3,490,10],[482,1,503,1],[486,3,486,16],[85,3,85,10],[794,1,815,1],[795,7,795,11],[798,3,798,16],[799,3,799,16],[802,3,802,10],[802,12,802,15],[804,3,804,10],[805,3,805,10],[806,3,806,10],[807,4,807,9],[458,1,479,1],[459,7,459,11],[462,3,462,16],[464,12,464,16],[466,3,466,10],[466,12,466,15],[468,3,468,10],[469,3,469,10],[470,3,470,10],[471,4,471,9],[438,3,438,16],[439,3,439,16],[444,3,444,10],[445,3,445,10],[446,3,446,10],[780,3,780,10],[507,7,507,11],[510,3,510,16],[511,3,511,16],[488,12,488,16],[483,7,483,11],[531,7,531,11],[534,3,534,16],[536,12,536,16],[538,3,538,10],[538,12,538,15],[540,3,540,10],[541,3,541,10],[542,3,542,10],[543,4,543,9],[678,3,678,16],[562,12,562,15],[564,3,564,10],[565,3,565,10]]}
[]
[null,{"$f":"D3","v":"HK-140002-VE"}]
[null,null,null,"HK-140002-VE",null,null,null,{"$f":"\"有用な技術の位置づけ：\"&VLOOKUP(D3,一覧表!$E:$G,3,FALSE)","v":"有用な技術の位置づけ：準推奨"},null,null,null,null,null,null,null,{"$f":"HYPERLINK(\"#一覧表!h\"&MATCH(D3,一覧表!E:E,0),\"一覧表に戻る\")","v":"一覧表に戻る"},1]
[null,null,null,{"$f":"\"（工種 ： \"&VLOOKUP(D3,一覧表!$E:$AE,25,FALSE)&\"－\"&VLOOKUP(D3,一覧表!$E:$AE,26,FALSE)&\"－\"&IF(VLOOKUP(D3,一覧表!$E:$AE,27,FALSE)=\"\",\"　　　　　\",VLOOKUP(D3,一覧表!$E:$AE,27,FALSE))&\"）\"","v":"（工種 ： 橋梁上部工－橋梁用伸縮継手装置設置工－　　　　　）"}]
[]
[null,null,null,{"$f":"VLOOKUP(D3,一覧表!$E:$L,2,FALSE)","v":"橋梁用埋設型排水桝"}]
[null,null,null,{"$f":"\"  副題 ： \"&VLOOKUP(D3,一覧表!$E:$AA,22,FALSE)","v":"  副題 ： ・上面+側面集水型「D3(ディースリー)パイプ」 ・側面集水型「ジョイントドレーン」"}]
[null,null,null,null,null,null,null,null,null,null,null,null,{"$f":"\"開発者名 ： \"&VLOOKUP(D3,一覧表!$E:$AA,23,FALSE)","v":"開発者名 ： 中大実業株式会社 西日本高速道路メンテナンス関西株式会社 "}]
[]
[null,null,null,"概要、新規性及び期待される効果等",null,null,null,null,null,null,null,null,"図表等"]
[]
[null,null,null,{"$f":"VLOOKUP(D3,一覧表!$E:$L,7,FALSE)","v":"本製品はコンクリート床版上の雨水を排水するための床版排水用の雨水桝です。 伸縮装置取り換え工事と同時に設置を行い、遊間を利用して排水する技術です。 コアドリルによる削孔作業が不要なため施工が早いのが最大の特徴です。"}]
[null,null,null,"活用の効果"]
[null,null,null,{"$f":"\"比較する従来技術 ： \"&VLOOKUP(D3,一覧表!$E:$L,8,FALSE)","v":"比較する従来技術 ： 溶融亜鉛メッキ製 水抜き管(床版を削孔して設置する場合)"}]
[null,null,null,"項目","申請情報",null,null,null,null,null,"評価結果\n（C：同程度）"]
[null,null,null,"経済性",{"$f":"IF(LEFT(VLOOKUP(概要版1!D3,一覧表!$E:$X,9,FALSE),2)=\"向上\",\"■\",\"□\")","v":"■"},{"$f":"IF(LEFT(VLOOKUP(概要版1!D3,一覧表!$E:$X,9,FALSE),2)=\"向上\",VLOOKUP(概要版1!D3,一覧表!$E:$X,9,FALSE),\"向上\")","v":"向上(17%)"},{"$f":"IF(VLOOKUP(概要版1!D3,一覧表!$E:$X,9,FALSE)=\"同程度\",\"■\",\"□\")","v":"□"},"同程度",{"$f":"IF(LEFT(VLOOKUP(概要版1!D3,一覧表!$E:$X,9,FALSE),2)=\"低下\",\"■\",\"□\")","v":"□"},{"$f":"IF(LEFT(VLOOKUP(概要版1!D3,一覧表!$E:$X,9,FALSE),2)=\"低下\",VLOOKUP(概要版1!D3,一覧表!$E:$X,9,FALSE),\"低下\")","v":"低下"},{"$f":"VLOOKUP(概要版1!D3,一覧表!$E:$X,15,FALSE)","v":"B"}]
[null,null,null,"工程",{"$f":"IF(LEFT(VLOOKUP(概要版1!D3,一覧表!$E:$X,10,FALSE),2)=\"短縮\",\"■\",\"□\")","v":"■"},{"$f":"IF(LEFT(VLOOKUP(概要版1!D3,一覧表!$E:$X,10,FALSE),2)=\"短縮\",VLOOKUP(概要版1!D3,一覧表!$E:$X,10,FALSE),\"短縮\")","v":"短縮(75%)"},{"$f":"IF(VLOOKUP(概要版1!D3,一覧表!$E:$X,10,FALSE)=\"同程度\",\"■\",\"□\")","v":"□"},"同程度",{"$f":"IF(LEFT(VLOOKUP(概要版1!D3,一覧表!$E:$X,10,FALSE),2)=\"増加\",\"■\",\"□\")","v":"□"},{"$f":"IF(LEFT(VLOOKUP(概要版1!D3,一覧表!$E:$X,10,FALSE),2)=\"増加\",VLOOKUP(概要版1!D3,一覧表!$E:$X,10,FALSE),\"増加\")","v":"増加"},{"$f":"VLOOKUP(概要版1!D3,一覧表!$E:$X,16,FALSE)","v":"B"}]
[null,null,null,"品質",{"$f":"IF(VLOOKUP(概要版1!D3,一覧表!$E:$X,11,FALSE)=\"向上\",\"■\",\"□\")","v":"□"},"向上",{"$f":"IF(VLOOKUP(概要版1!D3,一覧表!$E:$X,11,FALSE)=\"同程度\",\"■\",\"□\")","v":"■"},"同程度",{"$f":"IF(VLOOKUP(概要版1!D3,一覧表!$E:$X,11,FALSE)=\"低下\",\"■\",\"□\")","v":"□"},"低下",{"$f":"VLOOKUP(概要版1!D3,一覧表!$E:$X,17,FALSE)","v":"B"}]
[null,null,null,"安全性",{"$f":"IF(VLOOKUP(概要版1!D3,一覧表!$E:$X,12,FALSE)=\"向上\",\"■\",\"□\")","v":"□"},"向上",{"$f":"IF(VLOOKUP(概要版1!D3,一覧表!$E:$X,12,FALSE)=\"同程度\",\"■\",\"□\")","v":"■"},"同程度",{"$f":"IF(VLOOKUP(概要版1!D3,一覧表!$E:$X,12,FALSE)=\"低下\",\"■\",\"□\")","v":"□"},"低下",{"$f":"VLOOKUP(概要版1!D3,一覧表!$E:$X,18,FALSE)","v":"C"}]
[null,null,null,"施工性",{"$f":"IF(VLOOKUP(概要版1!D3,一覧表!$E:$X,13,FALSE)=\"向上\",\"■\",\"□\")","v":"■"},"向上",{"$f":"IF(VLOOKUP(概要版1!D3,一覧表!$E:$X,13,FALSE)=\"同程度\",\"■\",\"□\")","v":"□"},"同程度",{"$f":"IF(VLOOKUP(概要版1!D3,一覧表!$E:$X,13,FALSE)=\"低下\",\"■\",\"□\")","v":"□"},"低下",{"$f":"VLOOKUP(概要版1!D3,一覧表!$E:$X,19,FALSE)","v":"B"}]
[null,null,null,"環境",{"$f":"IF(VLOOKUP(概要版1!D3,一覧表!$E:$X,14,FALSE)=\"向上\",\"■\",\"□\")","v":"□"},"向上",{"$f":"IF(VLOOKUP(概要版1!D3,一覧表!$E:$X,14,FALSE)=\"同程度\",\"■\",\"□\")","v":"■"},"同程度",{"$f":"IF(VLOOKUP(概要版1!D3,一覧表!$E:$X,14,FALSE)=\"低下\",\"■\",\"□\")","v":"□"},"低下",{"$f":"VLOOKUP(概要版1!D3,一覧表!$E:$X,20,FALSE)","v":"C"}]
[]
[]
[]
[]
[null,{"$f":"D27","v":"KK-150069-VE"}]
[null,null,null,"KK-150069-VE",null,null,null,{"$f":"\"有用な技術の位置づけ：\"&VLOOKUP(D27,一覧表!$E:$G,3,FALSE)","v":"有用な技術の位置づけ：準推奨"},null,null,null,null,null,null,null,{"$f":"HYPERLINK(\"#一覧表!h\"&MATCH(D27,一覧表!E:E,0),\"一覧表に戻る\")","v":"一覧表に戻る"},{"$f":"Q3+1","v":2}]
[null,null,null,{"$f":"\"（工種 ： \"&VLOOKUP(D27,一覧表!$E:$AE,25,FALSE)&\"－\"&VLOOKUP(D27,一覧表!$E:$AE,26,FALSE)&\"－\"&IF(VLOOKUP(D27,一覧表!$E:$AE,27,FALSE)=\"\",\"　　　　　\",VLOOKUP(D27,一覧表!$E:$AE,27,FALSE))&\"）\"","v":"（工種 ： 調査試験－構造物調査－非破壊試験、調査）"}]
[]
[null,null,null,{"$f":"VLOOKUP(D27,一覧表!$E:$L,2,FALSE)","v":"鋼製埋設部路面境界部の損傷判定、診断方法"}]
[null,null,null,{"$f":"\"  副題 ： \"&VLOOKUP(D27,一覧表!$E:$AA,22,FALSE)","v":"  副題 ： パルス渦流法、超音波法を併用した路面境界部(地際腐食)の非破壊検査システム"}]
[null,null,null,null,null,null,null,null,null,null,null,null,{"$f":"\"開発者名 ： \"&VLOOKUP(D27,一覧表!$E:$AA,23,FALSE)","v":"開発者名 ： 株式会社コベルコ科研、神鋼検査サービス株式会社"}]
[]
[null,null,null,"概要、新規性及び期待される効果等",null,null,null,null,null,null,null,null,"図表等"]
[]
[null,null,null,{"$f":"VLOOKUP(D27,一覧表!$E:$L,7,FALSE)","v":"本技術は、パルス渦流法による迅速スクリーニング及び超音波表面SH波法による詳細検査を組合せ、効率的に路面境界部の損傷状況を可視化することを特徴とし、本技術の活用により品質、経済性、安全性、施工性の向上と工程の短縮が期待できる。"}]
[null,null,null,"活用の効果"]
[null,null,null,{"$f":"\"比較する従来技術 ： \"&VLOOKUP(D27,一覧表!$E:$L,8,FALSE)","v":"比較する従来技術 ： 掘削による鋼製埋設物路面境界部の腐食状況検査"}]
[null,null,null,"項目","申請情報",null,null,null,null,null,"評価結果\n（C：同程度）"]
[null,null,null,"経済性",{"$f":"IF(LEFT(VLOOKUP(概要版1!D27,一覧表!$E:$X,9,FALSE),2)=\"向上\",\"■\",\"□\")","v":"■"},{"$f":"IF(LEFT(VLOOKUP(概要版1!D27,一覧表!$E:$X,9,FALSE),2)=\"向上\",VLOOKUP(概要版1!D27,一覧表!$E:$X,9,FALSE),\"向上\")","v":"向上\n(56%)\n"},{"$f":"IF(VLOOKUP(概要版1!D27,一覧表!$E:$X,9,FALSE)=\"同程度\",\"■\",\"□\")","v":"□"},"同程度",{"$f":"IF(LEFT(VLOOKUP(概要版1!D27,一覧表!$E:$X,9,FALSE),2)=\"低下\",\"■\",\"□\")","v":"□"},{"$f":"IF(LEFT(VLOOKUP(概要版1!D27,一覧表!$E:$X,9,FALSE),2)=\"低下\",VLOOKUP(概要版1!D27,一覧表!$E:$X,9,FALSE),\"低下\")","v":"低下"},{"$f":"VLOOKUP(概要版1!D27,一覧表!$E:$X,15,FALSE)","v":"B"}]
[null,null,null,"工程",{"$f":"IF(LEFT(VLOOKUP(概要版1!D27,一覧表!$E:$X,10,FALSE),2)=\"短縮\",\"■\",\"□\")","v":"■"},{"$f":"IF(LEFT(VLOOKUP(概要版1!D27,一覧表!$E:$X,10,FALSE),2)=\"短縮\",VLOOKUP(概要版1!D27,一覧表!$E:$X,10,FALSE),\"短縮\")","v":"短縮\n(81%)\n"},{"$f":"IF(VLOOKUP(概要版1!D27,一覧表!$E:$X,10,FALSE)=\"同程度\",\"■\",\"□\")","v":"□"},"同程度",{"$f":"IF(LEFT(VLOOKUP(概要版1!D27,一覧表!$E:$X,10,FALSE),2)=\"増加\",\"■\",\"□\")","v":"□"},{"$f":"IF(LEFT(VLOOKUP(概要版1!D27,一覧表!$E:$X,10,FALSE),2)=\"増加\",VLOOKUP(概要版1!D27,一覧表!$E:$X,10,FALSE),\"増加\")","v":"増加"},{"$f":"VLOOKUP(概要版1!D27,一覧表!$E:$X,16,FALSE)","v":"B"}]
[null,null,null,"品質",{"$f":"IF(VLOOKUP(概要版1!D27,一覧表!$E:$X,11,FALSE)=\"向上\",\"■\",\"□\")","v":"■"},"向上",{"$f":"IF(VLOOKUP(概要版1!D27,一覧表!$E:$X,11,FALSE)=\"同程度\",\"■\",\"□\")","v":"□"},"同程度",{"$f":"IF(VLOOKUP(概要版1!D27,一覧表!$E:$X,11,FALSE)=\"低下\",\"■\",\"□\")","v":"□"},"低下",{"$f":"VLOOKUP(概要版1!D27,一覧表!$E:$X,17,FALSE)","v":"B"}]
[null,null,null,"安全性",{"$f":"IF(VLOOKUP(概要版1!D27,一覧表!$E:$X,12,FALSE)=\"向上\",\"■\",\"□\")","v":"■"},"向上",{"$f":"IF(VLOOKUP(概要版1!D27,一覧表!$E:$X,12,FALSE)=\"同程度\",\"■\",\"□\")","v":"□"},"同程度",{"$f":"IF(VLOOKUP(概要版1!D27,一覧表!$E:$X,12,FALSE)=\"低下\",\"■\",\"□\")","v":"□"},"低下",{"$f":"VLOOKUP(概要版1!D27,一覧表!$E:$X,18,FALSE)","v":"B"}]
[null,null,null,"施工性",{"$f":"IF(VLOOKUP(概要版1!D27,一覧表!$E:$X,13,FALSE)=\"向上\",\"■\",\"□\")","v":"■"},"向上",{"$f":"IF(VLOOKUP(概要版1!D27,一覧表!$E:$X,13,FALSE)=\"同程度\",\"■\",\"□\")","v":"□"},"同程度",{"$f":"IF(VLOOKUP(概要版1!D27,一覧表!$E:$X,13,FALSE)=\"低下\",\"■\",\"□\")","v":"□"},"低下",{"$f":"VLOOKUP(概要版1!D27,一覧表!$E:$X,19,FALSE)","v":"B"}]
[null,null,null,"環境",{"$f":"IF(VLOOKUP(概要版1!D27,一覧表!$E:$X,14,FALSE)=\"向上\",\"■\",\"□\")","v":"■"},"向上",{"$f":"IF(VLOOKUP(概要版1!D27,一覧表!$E:$X,14,FALSE)=\"同程度\",\"■\",\"□\")","v":"□"},"同程度",{"$f":"IF(VLOOKUP(概要版1!D27,一覧表!$E:$X,14,FALSE)=\"低下\",\"■\",\"□\")","v":"□"},"低下",{"$f":"VLOOKUP(概要版1!D27,一覧表!$E:$X,20,FALSE)","v":"A"}]
[]
[]
[]
[]
[null,{"$f":"D51","v":"KT-130057-VE"}]
[null,null,null,"KT-130057-VE",null,null,null,{"$f":"\"有用な技術の位置づけ：\"&VLOOKUP(D51,一覧表!$E:$G,3,FALSE)","v":"有用な技術の位置づけ：準推奨"},null,null,null,null,null,null,null,{"$f":"HYPERLINK(\"#一覧表!h\"&MATCH(D51,一覧表!E:E,0),\"一覧表に戻る\")","v":"一覧表に戻る"},{"$f":"Q27+1","v":3}]
[null,null,null,{"$f":"\"（工種 ： \"&VLOOKUP(D51,一覧表!$E:$AE,25,FALSE)&\"－\"&VLOOKUP(D51,一覧表!$E:$AE,26,FALSE)&\"－\"&IF(VLOOKUP(D51,一覧表!$E:$AE,27,FALSE)=\"\",\"　　　　　\",VLOOKUP(D51,一覧表!$E:$AE,27,FALSE))&\"）\"","v":"（工種 ： 調査試験－構造物調査－非破壊試験、調査）"}]
[]
[null,null,null,{"$f":"VLOOKUP(D51,一覧表!$E:$L,2,FALSE)","v":"支柱路面境界部検査システム"}]
[null,null,null,{"$f":"\"  副題 ： \"&VLOOKUP(D51,一覧表!$E:$AA,22,FALSE)","v":"  副題 ： 超音波による路面境界部の非破壊検査システム「キズミー1」"}]
[null,null,null,null,null,null,null,null,null,null,null,null,{"$f":"\"開発者名 ： \"&VLOOKUP(D51,一覧表!$E:$AA,23,FALSE)","v":"開発者名 ： 株式会社リンク、MKエンジニアリング株式会社"}]
[]
[null,null,null,"概要、新規性及び期待される効果等",null,null,null,null,null,null,null,null,"図表等"]
[]
[null,null,null,{"$f":"VLOOKUP(D51,一覧表!$E:$L,7,FALSE)","v":"本技術は、複数のモードの超音波を使用して支柱路面境界部の検査を行う技術で、従来は、掘削後に目視および超音波厚さ計で行う検査で対応していた。本技術の活用により、掘削・復旧の工程がなくなるので、工期短縮、安全性の向上が図れます。"}]
[null,null,null,"活用の効果"]
[null,null,null,{"$f":"\"比較する従来技術 ： \"&VLOOKUP(D51,一覧表!$E:$L,8,FALSE)","v":"比較する従来技術 ： 掘削後に目視および超音波厚さ計で行う検査"}]
[null,null,null,"項目","申請情報",null,null,null,null,null,"評価結果\n（C：同程度）"]
[null,null,null,"経済性",{"$f":"IF(LEFT(VLOOKUP(概要版1!D51,一覧表!$E:$X,9,FALSE),2)=\"向上\",\"■\",\"□\")","v":"□"},{"$f":"IF(LEFT(VLOOKUP(概要版1!D51,一覧表!$E:$X,9,FALSE),2)=\"向上\",VLOOKUP(概要版1!D51,一覧表!$E:$X,9,FALSE),\"向上\")","v":"向上"},{"$f":"IF(VLOOKUP(概要版1!D51,一覧表!$E:$X,9,FALSE)=\"同程度\",\"■\",\"□\")","v":"□"},"同程度",{"$f":"IF(LEFT(VLOOKUP(概要版1!D51,一覧表!$E:$X,9,FALSE),2)=\"低下\",\"■\",\"□\")","v":"■"},{"$f":"IF(LEFT(VLOOKUP(概要版1!D51,一覧表!$E:$X,9,FALSE),2)=\"低下\",VLOOKUP(概要版1!D51,一覧表!$E:$X,9,FALSE),\"低下\")","v":"低下(-10%)"},{"$f":"VLOOKUP(概要版1!D51,一覧表!$E:$X,15,FALSE)","v":"A"}]
[null,null,null,"工程",{"$f":"IF(LEFT(VLOOKUP(概要版1!D51,一覧表!$E:$X,10,FALSE),2)=\"短縮\",\"■\",\"□\")","v":"■"},{"$f":"IF(LEFT(VLOOKUP(概要版1!D51,一覧表!$E:$X,10,FALSE),2)=\"短縮\",VLOOKUP(概要版1!D51,一覧表!$E:$X,10,FALSE),\"短縮\")","v":"短縮(62%)"},{"$f":"IF(VLOOKUP(概要版1!D51,一覧表!$E:$X,10,FALSE)=\"同程度\",\"■\",\"□\")","v":"□"},"同程度",{"$f":"IF(LEFT(VLOOKUP(概要版1!D51,一覧表!$E:$X,10,FALSE),2)=\"増加\",\"■\",\"□\")","v":"□"},{"$f":"IF(LEFT(VLOOKUP(概要版1!D51,一覧表!$E:$X,10,FALSE),2)=\"増加\",VLOOKUP(概要版1!D51,一覧表!$E:$X,10,FALSE),\"増加\")","v":"増加"},{"$f":"VLOOKUP(概要版1!D51,一覧表!$E:$X,16,FALSE)","v":"A"}]
[null,null,null,"品質",{"$f":"IF(VLOOKUP(概要版1!D51,一覧表!$E:$X,11,FALSE)=\"向上\",\"■\",\"□\")","v":"□"},"向上",{"$f":"IF(VLOOKUP(概要版1!D51,一覧表!$E:$X,11,FALSE)=\"同程度\",\"■\",\"□\")","v":"■"},"同程度",{"$f":"IF(VLOOKUP(概要版1!D51,一覧表!$E:$X,11,FALSE)=\"低下\",\"■\",\"□\")","v":"□"},"低下",{"$f":"VLOOKUP(概要版1!D51,一覧表!$E:$X,17,FALSE)","v":"C"}]
[null,null,null,"安全性",{"$f":"IF(VLOOKUP(概要版1!D51,一覧表!$E:$X,12,FALSE)=\"向上\",\"■\",\"□\")","v":"■"},"向上",{"$f":"IF(VLOOKUP(概要版1!D51,一覧表!$E:$X,12,FALSE)=\"同程度\",\"■\",\"□\")","v":"□"},"同程度",{"$f":"IF(VLOOKUP(概要版1!D51,一覧表!$E:$X,12,FALSE)=\"低下\",\"■\",\"□\")","v":"□"},"低下",{"$f":"VLOOKUP(概要版1!D51,一覧表!$E:$X,18,FALSE)","v":"B"}]
[null,null,null,"施工性",{"$f":"IF(VLOOKUP(概要版1!D51,一覧表!$E:$X,13,FALSE)=\"向上\",\"■\",\"□\")","v":"■"},"向上",{"$f":"IF(VLOOKUP(概要版1!D51,一覧表!$E:$X,13,FALSE)=\"同程度\",\"■\",\"□\")","v":"□"},"同程度",{"$f":"IF(VLOOKUP(概要版1!D51,一覧表!$E:$X,13,FALSE)=\"低下\",\"■\",\"□\")","v":"□"},"低下",{"$f":"VLOOKUP(概要版1!D51,一覧表!$E:$X,19,FALSE)","v":"B"}]
[null,null,null,"環境",{"$f":"IF(VLOOKUP(概要版1!D51,一覧表!$E:$X,14,FALSE)=\"向上\",\"■\",\"□\")","v":"□"},"向上",{"$f":"IF(VLOOKUP(概要版1!D51,一覧表!$E:$X,14,FALSE)=\"同程度\",\"■\",\"□\")","v":"■"},"同程度",{"$f":"IF(VLOOKUP(概要版1!D51,一覧表!$E:$X,14,FALSE)=\"低下\",\"■\",\"□\")","v":"□"},"低下",{"$f":"VLOOKUP(概要版1!D51,一覧表!$E:$X,20,FALSE)","v":"B"}]
[]
[]
[]
[]
[null,{"$f":"D75","v":"KT-170065-VE"}]
[null,null,null,"KT-170065-VE",null,null,null,{"$f":"\"有用な技術の位置づけ：\"&VLOOKUP(D75,一覧表!$E:$G,3,FALSE)","v":"有用な技術の位置づけ：活用促進"},null,null,null,null,null,null,null,{"$f":"HYPERLINK(\"#一覧表!h\"&MATCH(D75,一覧表!E:E,0),\"一覧表に戻る\")","v":"一覧表に戻る"},{"$f":"Q51+1","v":4}]
[null,null,null,{"$f":"\"（工種 ： \"&VLOOKUP(D75,一覧表!$E:$AE,25,FALSE)&\"－\"&VLOOKUP(D75,一覧表!$E:$AE,26,FALSE)&\"－\"&IF(VLOOKUP(D75,一覧表!$E:$AE,27,FALSE)=\"\",\"　　　　　\",VLOOKUP(D75,一覧表!$E:$AE,27,FALSE))&\"）\"","v":"（工種 ： コンクリート工－コンクリート工－鉄筋工）"}]
[]
[null,null,null,{"$f":"VLOOKUP(D75,一覧表!$E:$L,2,FALSE)","v":"錆転化処理剤・鉄筋防錆剤「ラストクエンチ」"}]
[null,null,null,{"$f":"\"  副題 ： \"&VLOOKUP(D75,一覧表!$E:$AA,22,FALSE)","v":"  副題 ： 錆びた鉄筋に塗布するだけで鉄材や赤錆部分を安定して強固な黒皮被膜に転化し、さらに樹脂皮膜を形成することによって防錆効果を発揮。付着を妨げない錆転化型防錆剤"}]
[null,null,null,null,null,null,null,null,null,null,null,null,{"$f":"\"開発者名 ： \"&VLOOKUP(D75,一覧表!$E:$AA,23,FALSE)","v":"開発者名 ： 株式会社ノックス "}]
[]
[null,null,null,"概要、新規性及び期待される効果等",null,null,null,null,null,null,null,null,"図表等"]
[]
[null,null,null,{"$f":"VLOOKUP(D75,一覧表!$E:$L,7,FALSE)","v":"本技術は、錆びた部分等の鉄筋の塗布型錆転化処理剤及び防錆剤(ラストクエンチ)で、従来は、鉄筋の錆をケレン作業で除去した後、防錆剤を塗布していた。本技術の活用により、ケレン作業等が省け工程が短縮し経済性が向上。複雑な配筋部等でも作業が可能で施工性も向上する。 "}]
[null,null,null,"活用の効果"]
[null,null,null,{"$f":"\"比較する従来技術 ： \"&VLOOKUP(D75,一覧表!$E:$L,8,FALSE)","v":"比較する従来技術 ： 錆びた鉄筋にケレン作業を施した後、防錆剤を塗布 "}]
[null,null,null,"項目","申請情報",null,null,null,null,null,"評価結果\n（C：同程度）"]
[null,null,null,"経済性",{"$f":"IF(LEFT(VLOOKUP(概要版1!D75,一覧表!$E:$X,9,FALSE),2)=\"向上\",\"■\",\"□\")","v":"■"},{"$f":"IF(LEFT(VLOOKUP(概要版1!D75,一覧表!$E:$X,9,FALSE),2)=\"向上\",VLOOKUP(概要版1!D75,一覧表!$E:$X,9,FALSE),\"向上\")","v":"向上\n(45%)\n"},{"$f":"IF(VLOOKUP(概要版1!D75,一覧表!$E:$X,9,FALSE)=\"同程度\",\"■\",\"□\")","v":"□"},"同程度",{"$f":"IF(LEFT(VLOOKUP(概要版1!D75,一覧表!$E:$X,9,FALSE),2)=\"低下\",\"■\",\"□\")","v":"□"},{"$f":"IF(LEFT(VLOOKUP(概要版1!D75,一覧表!$E:$X,9,FALSE),2)=\"低下\",VLOOKUP(概要版1!D75,一覧表!$E:$X,9,FALSE),\"低下\")","v":"低下"},{"$f":"VLOOKUP(概要版1!D75,一覧表!$E:$X,15,FALSE)","v":"B"}]
[null,null,null,"工程",{"$f":"IF(LEFT(VLOOKUP(概要版1!D75,一覧表!$E:$X,10,FALSE),2)=\"短縮\",\"■\",\"□\")","v":"■"},{"$f":"IF(LEFT(VLOOKUP(概要版1!D75,一覧表!$E:$X,10,FALSE),2)=\"短縮\",VLOOKUP(概要版1!D75,一覧表!$E:$X,10,FALSE),\"短縮\")","v":"短縮\n(53%)\n"},{"$f":"IF(VLOOKUP(概要版1!D75,一覧表!$E:$X,10,FALSE)=\"同程度\",\"■\",\"□\")","v":"□"},"同程度",{"$f":"IF(LEFT(VLOOKUP(概要版1!D75,一覧表!$E:$X,10,FALSE),2)=\"増加\",\"■\",\"□\")","v":"□"},{"$f":"IF(LEFT(VLOOKUP(概要版1!D75,一覧表!$E:$X,10,FALSE),2)=\"増加\",VLOOKUP(概要版1!D75,一覧表!$E:$X,10,FALSE),\"増加\")","v":"増加"},{"$f":"VLOOKUP(概要版1!D75,一覧表!$E:$X,16,FALSE)","v":"B"}]
[null,null,null,"品質",{"$f":"IF(VLOOKUP(概要版1!D75,一覧表!$E:$X,11,FALSE)=\"向上\",\"■\",\"□\")","v":"□"},"向上",{"$f":"IF(VLOOKUP(概要版1!D75,一覧表!$E:$X,11,FALSE)=\"同程度\",\"■\",\"□\")","v":"■"},"同程度",{"$f":"IF(VLOOKUP(概要版1!D75,一覧表!$E:$X,11,FALSE)=\"低下\",\"■\",\"□\")","v":"□"},"低下",{"$f":"VLOOKUP(概要版1!D75,一覧表!$E:$X,17,FALSE)","v":"B"}]
[null,null,null,"安全性",{"$f":"IF(VLOOKUP(概要版1!D75,一覧表!$E:$X,12,FALSE)=\"向上\",\"■\",\"□\")","v":"■"},"向上",{"$f":"IF(VLOOKUP(概要版1!D75,一覧表!$E:$X,12,FALSE)=\"同程度\",\"■\",\"□\")","v":"□"},"同程度",{"$f":"IF(VLOOKUP(概要版1!D75,一覧表!$E:$X,12,FALSE)=\"低下\",\"■\",\"□\")","v":"□"},"低下",{"$f":"VLOOKUP(概要版1!D75,一覧表!$E:$X,18,FALSE)","v":"B"}]
[null,null,null,"施工性",{"$f":"IF(VLOOKUP(概要版1!D75,一覧表!$E:$X,13,FALSE)=\"向上\",\"■\",\"□\")","v":"■"},"向上",{"$f":"IF(VLOOKUP(概要版1!D75,一覧表!$E:$X,13,FALSE)=\"同程度\",\"■\",\"□\")","v":"□"},"同程度",{"$f":"IF(VLOOKUP(概要版1!D75,一覧表!$E:$X,13,FALSE)=\"低下\",\"■\",\"□\")","v":"□"},"低下",{"$f":"VLOOKUP(概要版1!D75,一覧表!$E:$X,19,FALSE)","v":"A"}]
[null,null,null,"環境",{"$f":"IF(VLOOKUP(概要版1!D75,一覧表!$E:$X,14,FALSE)=\"向上\",\"■\",\"□\")","v":"■"},"向上",{"$f":"IF(VLOOKUP(概要版1!D75,一覧表!$E:$X,14,FALSE)=\"同程度\",\"■\",\"□\")","v":"□"},"同程度",{"$f":"IF(VLOOKUP(概要版1!D75,一覧表!$E:$X,14,FALSE)=\"低下\",\"■\",\"□\")","v":"□"},"低下",{"$f":"VLOOKUP(概要版1!D75,一覧表!$E:$X,20,FALSE)","v":"B"}]
[]
[]
[]
[]
[null,{"$f":"D99","v":"KT-130065-VE"}]
[null,null,null,"KT-130065-VE",null,null,null,{"$f":"\"有用な技術の位置づけ：\"&VLOOKUP(D99,一覧表!$E:$G,3,FALSE)","v":"有用な技術の位置づけ：活用促進"},null,null,null,null,null,null,null,{"$f":"HYPERLINK(\"#一覧表!h\"&MATCH(D99,一覧表!E:E,0),\"一覧表に戻る\")","v":"一覧表に戻る"},{"$f":"Q75+1","v":5}]
[null,null,null,{"$f":"\"（工種 ： \"&VLOOKUP(D99,一覧表!$E:$AE,25,FALSE)&\"－\"&VLOOKUP(D99,一覧表!$E:$AE,26,FALSE)&\"－\"&IF(VLOOKUP(D99,一覧表!$E:$AE,27,FALSE)=\"\",\"　　　　　\",VLOOKUP(D99,一覧表!$E:$AE,27,FALSE))&\"）\"","v":"（工種 ： コンクリート工－コンクリート工－その他）"}]
[]
[null,null,null,{"$f":"VLOOKUP(D99,一覧表!$E:$L,2,FALSE)","v":"無機質けい酸塩系含浸材「ポルトガードプレクサス」"}]
[null,null,null,{"$f":"\"  副題 ： \"&VLOOKUP(D99,一覧表!$E:$AA,22,FALSE)","v":"  副題 ： 散水養生が不要なけい酸塩系(ナトリウム・カリウム・リチウム混合型)含浸材"}]
[null,null,null,null,null,null,null,null,null,null,null,null,{"$f":"\"開発者名 ： \"&VLOOKUP(D99,一覧表!$E:$AA,23,FALSE)","v":"開発者名 ： 株式会社セントラルコンクリート、株式会社グリーンドゥ"}]
[]
[null,null,null,"概要、新規性及び期待される効果等",null,null,null,null,null,null,null,null,"図表等"]
[]
[null,null,null,{"$f":"VLOOKUP(D99,一覧表!$E:$L,7,FALSE)","v":"本技術はコンクリート表面保護に用いる散水養生不要のけい酸塩系含浸材であり、従来は散水養生を必要とするけい酸塩系含浸材で対応していた。本技術の活用によりカリウムの反応促進作用により散水養生が不要となるため、施工性の向上と経済性の向上が得られる。"}]
[null,null,null,"活用の効果"]
[null,null,null,{"$f":"\"比較する従来技術 ： \"&VLOOKUP(D99,一覧表!$E:$L,8,FALSE)","v":"比較する従来技術 ： 散水養生を必要とするけい酸塩系含浸材\n"}]
[null,null,null,"項目","申請情報",null,null,null,null,null,"評価結果\n（C：同程度）"]
[null,null,null,"経済性",{"$f":"IF(LEFT(VLOOKUP(概要版1!D99,一覧表!$E:$X,9,FALSE),2)=\"向上\",\"■\",\"□\")","v":"■"},{"$f":"IF(LEFT(VLOOKUP(概要版1!D99,一覧表!$E:$X,9,FALSE),2)=\"向上\",VLOOKUP(概要版1!D99,一覧表!$E:$X,9,FALSE),\"向上\")","v":"向上\n(30%)\n"},{"$f":"IF(VLOOKUP(概要版1!D99,一覧表!$E:$X,9,FALSE)=\"同程度\",\"■\",\"□\")","v":"□"},"同程度",{"$f":"IF(LEFT(VLOOKUP(概要版1!D99,一覧表!$E:$X,9,FALSE),2)=\"低下\",\"■\",\"□\")","v":"□"},{"$f":"IF(LEFT(VLOOKUP(概要版1!D99,一覧表!$E:$X,9,FALSE),2)=\"低下\",VLOOKUP(概要版1!D99,一覧表!$E:$X,9,FALSE),\"低下\")","v":"低下"},{"$f":"VLOOKUP(概要版1!D99,一覧表!$E:$X,15,FALSE)","v":"B"}]
[null,null,null,"工程",{"$f":"IF(LEFT(VLOOKUP(概要版1!D99,一覧表!$E:$X,10,FALSE),2)=\"短縮\",\"■\",\"□\")","v":"■"},{"$f":"IF(LEFT(VLOOKUP(概要版1!D99,一覧表!$E:$X,10,FALSE),2)=\"短縮\",VLOOKUP(概要版1!D99,一覧表!$E:$X,10,FALSE),\"短縮\")","v":"短縮\n(67%)\n"},{"$f":"IF(VLOOKUP(概要版1!D99,一覧表!$E:$X,10,FALSE)=\"同程度\",\"■\",\"□\")","v":"□"},"同程度",{"$f":"IF(LEFT(VLOOKUP(概要版1!D99,一覧表!$E:$X,10,FALSE),2)=\"増加\",\"■\",\"□\")","v":"□"},{"$f":"IF(LEFT(VLOOKUP(概要版1!D99,一覧表!$E:$X,10,FALSE),2)=\"増加\",VLOOKUP(概要版1!D99,一覧表!$E:$X,10,FALSE),\"増加\")","v":"増加"},{"$f":"VLOOKUP(概要版1!D99,一覧表!$E:$X,16,FALSE)","v":"B"}]
[null,null,null,"品質",{"$f":"IF(VLOOKUP(概要版1!D99,一覧表!$E:$X,11,FALSE)=\"向上\",\"■\",\"□\")","v":"□"},"向上",{"$f":"IF(VLOOKUP(概要版1!D99,一覧表!$E:$X,11,FALSE)=\"同程度\",\"■\",\"□\")","v":"■"},"同程度",{"$f":"IF(VLOOKUP(概要版1!D99,一覧表!$E:$X,11,FALSE)=\"低下\",\"■\",\"□\")","v":"□"},"低下",{"$f":"VLOOKUP(概要版1!D99,一覧表!$E:$X,17,FALSE)","v":"C"}]
[null,null,null,"安全性",{"$f":"IF(VLOOKUP(概要版1!D99,一覧表!$E:$X,12,FALSE)=\"向上\",\"■\",\"□\")","v":"□"},"向上",{"$f":"IF(VLOOKUP(概要版1!D99,一覧表!$E:$X,12,FALSE)=\"同程度\",\"■\",\"□\")","v":"■"},"同程度",{"$f":"IF(VLOOKUP(概要版1!D99,一覧表!$E:$X,12,FALSE)=\"低下\",\"■\",\"□\")","v":"□"},"低下",{"$f":"VLOOKUP(概要版1!D99,一覧表!$E:$X,18,FALSE)","v":"C"}]
[null,null,null,"施工性",{"$f":"IF(VLOOKUP(概要版1!D99,一覧表!$E:$X,13,FALSE)=\"向上\",\"■\",\"□\")","v":"■"},"向上",{"$f":"IF(VLOOKUP(概要版1!D99,一覧表!$E:$X,13,FALSE)=\"同程度\",\"■\",\"□\")","v":"□"},"同程度",{"$f":"IF(VLOOKUP(概要版1!D99,一覧表!$E:$X,13,FALSE)=\"低下\",\"■\",\"□\")","v":"□"},"低下",{"$f":"VLOOKUP(概要版1!D99,一覧表!$E:$X,19,FALSE)","v":"B"}]
[null,null,null,"環境",{"$f":"IF(VLOOKUP(概要版1!D99,一覧表!$E:$X,14,FALSE)=\"向上\",\"■\",\"□\")","v":"□"},"向上",{"$f":"IF(VLOOKUP(概要版1!D99,一覧表!$E:$X,14,FALSE)=\"同程度\",\"■\",\"□\")","v":"□"},"同程度",{"$f":"IF(VLOOKUP(概要版1!D99,一覧表!$E:$X,14,FALSE)=\"低下\",\"■\",\"□\")","v":"□"},"低下",{"$f":"VLOOKUP(概要版1!D99,一覧表!$E:$X,20,FALSE)","v":"C"}]
[]
[]
[]
[]
[null,{"$f":"D123","v":"CG-160013-VE"}]
[null,null,null,"CG-160013-VE",null,null,null,{"$f":"\"有用な技術の位置づけ：\"&VLOOKUP(D123,一覧表!$E:$G,3,FALSE)","v":"有用な技術の位置づけ：活用促進"},null,null,null,null,null,null,null,{"$f":"HYPERLINK(\"#一覧表!h\"&MATCH(D123,一覧表!E:E,0),\"一覧表に戻る\")","v":"一覧表に戻る"},{"$f":"Q99+1","v":6}]
[null,null,null,{"$f":"\"（工種 ： \"&VLOOKUP(D123,一覧表!$E:$AE,25,FALSE)&\"－\"&VLOOKUP(D123,一覧表!$E:$AE,26,FALSE)&\"－\"&IF(VLOOKUP(D123,一覧表!$E:$AE,27,FALSE)=\"\",\"　　　　　\",VLOOKUP(D123,一覧表!$E:$AE,27,FALSE))&\"）\"","v":"（工種 ： コンクリート工－コンクリート工－その他）"}]
[]
[null,null,null,{"$f":"VLOOKUP(D123,一覧表!$E:$L,2,FALSE)","v":"けい酸塩系表面含浸材CS-21ネオ"}]
[null,null,null,{"$f":"\"  副題 ： \"&VLOOKUP(D123,一覧表!$E:$AA,22,FALSE)","v":"  副題 ： 新設コンクリート構造物の表面保護"}]
[null,null,null,null,null,null,null,null,null,null,null,null,{"$f":"\"開発者名 ： \"&VLOOKUP(D123,一覧表!$E:$AA,23,FALSE)","v":"開発者名 ： 株式会社アストン"}]
[]
[null,null,null,"概要、新規性及び期待される効果等",null,null,null,null,null,null,null,null,"図表等"]
[]
[null,null,null,{"$f":"VLOOKUP(D123,一覧表!$E:$L,7,FALSE)","v":"新設コンクリート構造物の表面保護に最適で、施工性が良好な反応型けい酸塩系表面含浸材。施工は清掃後の表面に材料を1回塗布のみで散水は不要。継続的な微細空隙の充填効果により、かぶりを健全に保ち鋼材腐食を抑制。更なる品質向上、耐久性向上、長寿命化に寄与する。 "}]
[null,null,null,"活用の効果"]
[null,null,null,{"$f":"\"比較する従来技術 ： \"&VLOOKUP(D123,一覧表!$E:$L,8,FALSE)","v":"比較する従来技術 ： 表面含浸工法(反応型けい酸塩系表面含浸工法)"}]
[null,null,null,"項目","申請情報",null,null,null,null,null,"評価結果\n（C：同程度）"]
[null,null,null,"経済性",{"$f":"IF(LEFT(VLOOKUP(概要版1!D123,一覧表!$E:$X,9,FALSE),2)=\"向上\",\"■\",\"□\")","v":"■"},{"$f":"IF(LEFT(VLOOKUP(概要版1!D123,一覧表!$E:$X,9,FALSE),2)=\"向上\",VLOOKUP(概要版1!D123,一覧表!$E:$X,9,FALSE),\"向上\")","v":"向上\n(59%)\n"},{"$f":"IF(VLOOKUP(概要版1!D123,一覧表!$E:$X,9,FALSE)=\"同程度\",\"■\",\"□\")","v":"□"},"同程度",{"$f":"IF(LEFT(VLOOKUP(概要版1!D123,一覧表!$E:$X,9,FALSE),2)=\"低下\",\"■\",\"□\")","v":"□"},{"$f":"IF(LEFT(VLOOKUP(概要版1!D123,一覧表!$E:$X,9,FALSE),2)=\"低下\",VLOOKUP(概要版1!D123,一覧表!$E:$X,9,FALSE),\"低下\")","v":"低下"},{"$f":"VLOOKUP(概要版1!D123,一覧表!$E:$X,15,FALSE)","v":"B"}]
[null,null,null,"工程",{"$f":"IF(LEFT(VLOOKUP(概要版1!D123,一覧表!$E:$X,10,FALSE),2)=\"短縮\",\"■\",\"□\")","v":"■"},{"$f":"IF(LEFT(VLOOKUP(概要版1!D123,一覧表!$E:$X,10,FALSE),2)=\"短縮\",VLOOKUP(概要版1!D123,一覧表!$E:$X,10,FALSE),\"短縮\")","v":"短縮\n(67%)\n"},{"$f":"IF(VLOOKUP(概要版1!D123,一覧表!$E:$X,10,FALSE)=\"同程度\",\"■\",\"□\")","v":"□"},"同程度",{"$f":"IF(LEFT(VLOOKUP(概要版1!D123,一覧表!$E:$X,10,FALSE),2)=\"増加\",\"■\",\"□\")","v":"□"},{"$f":"IF(LEFT(VLOOKUP(概要版1!D123,一覧表!$E:$X,10,FALSE),2)=\"増加\",VLOOKUP(概要版1!D123,一覧表!$E:$X,10,FALSE),\"増加\")","v":"増加"},{"$f":"VLOOKUP(概要版1!D123,一覧表!$E:$X,16,FALSE)","v":"B"}]
[null,null,null,"品質",{"$f":"IF(VLOOKUP(概要版1!D123,一覧表!$E:$X,11,FALSE)=\"向上\",\"■\",\"□\")","v":"■"},"向上",{"$f":"IF(VLOOKUP(概要版1!D123,一覧表!$E:$X,11,FALSE)=\"同程度\",\"■\",\"□\")","v":"□"},"同程度",{"$f":"IF(VLOOKUP(概要版1!D123,一覧表!$E:$X,11,FALSE)=\"低下\",\"■\",\"□\")","v":"□"},"低下",{"$f":"VLOOKUP(概要版1!D123,一覧表!$E:$X,17,FALSE)","v":"C"}]
[null,null,null,"安全性",{"$f":"IF(VLOOKUP(概要版1!D123,一覧表!$E:$X,12,FALSE)=\"向上\",\"■\",\"□\")","v":"■"},"向上",{"$f":"IF(VLOOKUP(概要版1!D123,一覧表!$E:$X,12,FALSE)=\"同程度\",\"■\",\"□\")","v":"□"},"同程度",{"$f":"IF(VLOOKUP(概要版1!D123,一覧表!$E:$X,12,FALSE)=\"低下\",\"■\",\"□\")","v":"□"},"低下",{"$f":"VLOOKUP(概要版1!D123,一覧表!$E:$X,18,FALSE)","v":"C"}]
[null,null,null,"施工性",{"$f":"IF(VLOOKUP(概要版1!D123,一覧表!$E:$X,13,FALSE)=\"向上\",\"■\",\"□\")","v":"■"},"向上",{"$f":"IF(VLOOKUP(概要版1!D123,一覧表!$E:$X,13,FALSE)=\"同程度\",\"■\",\"□\")","v":"□"},"同程度",{"$f":"IF(VLOOKUP(概要版1!D123,一覧表!$E:$X,13,FALSE)=\"低下\",\"■\",\"□\")","v":"□"},"低下",{"$f":"VLOOKUP(概要版1!D123,一覧表!$E:$X,19,FALSE)","v":"B"}]
[null,null,null,"環境",{"$f":"IF(VLOOKUP(概要版1!D123,一覧表!$E:$X,14,FALSE)=\"向上\",\"■\",\"□\")","v":"□"},"向上",{"$f":"IF(VLOOKUP(概要版1!D123,一覧表!$E:$X,14,FALSE)=\"同程度\",\"■\",\"□\")","v":"■"},"同程度",{"$f":"IF(VLOOKUP(概要版1!D123,一覧表!$E:$X,14,FALSE)=\"低下\",\"■\",\"□\")","v":"□"},"低下",{"$f":"VLOOKUP(概要版1!D123,一覧表!$E:$X,20,FALSE)","v":"C"}]
[]
[]
[]
[]
[null,{"$f":"D147","v":"CB-130007-VE"}]
[null,null,null,"CB-130007-VE",null,null,null,{"$f":"\"有用な技術の位置づけ：\"&VLOOKUP(D147,一覧表!$E:$G,3,FALSE)","v":"有用な技術の位置づけ：活用促進"},null,null,null,null,null,null,null,{"$f":"HYPERLINK(\"#一覧表!h\"&MATCH(D147,一覧表!E:E,0),\"一覧表に戻る\")","v":"一覧表に戻る"},{"$f":"Q123+1","v":7}]
[null,null,null,{"$f":"\"（工種 ： \"&VLOOKUP(D147,一覧表!$E:$AE,25,FALSE)&\"－\"&VLOOKUP(D147,一覧表!$E:$AE,26,FALSE)&\"－\"&IF(VLOOKUP(D147,一覧表!$E:$AE,27,FALSE)=\"\",\"　　　　　\",VLOOKUP(D147,一覧表!$E:$AE,27,FALSE))&\"）\"","v":"（工種 ： コンクリート工－その他－　　　　　）"}]
[]
[null,null,null,{"$f":"VLOOKUP(D147,一覧表!$E:$L,2,FALSE)","v":"ひび割れ補修浸透性エポキシ樹脂塗布工法"}]
[null,null,null,{"$f":"\"  副題 ： \"&VLOOKUP(D147,一覧表!$E:$AA,22,FALSE)","v":"  副題 ： 塗布・浸透型ひび割れ補修材アルファテック388"}]
[null,null,null,null,null,null,null,null,null,null,null,null,{"$f":"\"開発者名 ： \"&VLOOKUP(D147,一覧表!$E:$AA,23,FALSE)","v":"開発者名 ： 中日本高速技術マーケティング株式会社 アルファ工業株式会社"}]
[]
[null,null,null,"概要、新規性及び期待される効果等",null,null,null,null,null,null,null,null,"図表等"]
[]
[null,null,null,{"$f":"VLOOKUP(D147,一覧表!$E:$L,7,FALSE)","v":"ひび割れの奥まで補修する際に低圧注入器具を用いて補修材を注入していたのに対し、塗布だけでひび割れに補修材が浸透する工法です。 浸透性エポキシ樹脂接着剤「アルファテック388」を繰り返し塗布することで毛細管現象によってひび割れ内部にまで浸透します。"}]
[null,null,null,"活用の効果"]
[null,null,null,{"$f":"\"比較する従来技術 ： \"&VLOOKUP(D147,一覧表!$E:$L,8,FALSE)","v":"比較する従来技術 ： 低圧注入工法 "}]
[null,null,null,"項目","申請情報",null,null,null,null,null,"評価結果\n（C：同程度）"]
[null,null,null,"経済性",{"$f":"IF(LEFT(VLOOKUP(概要版1!D147,一覧表!$E:$X,9,FALSE),2)=\"向上\",\"■\",\"□\")","v":"■"},{"$f":"IF(LEFT(VLOOKUP(概要版1!D147,一覧表!$E:$X,9,FALSE),2)=\"向上\",VLOOKUP(概要版1!D147,一覧表!$E:$X,9,FALSE),\"向上\")","v":"向上\n(53%)\n"},{"$f":"IF(VLOOKUP(概要版1!D147,一覧表!$E:$X,9,FALSE)=\"同程度\",\"■\",\"□\")","v":"□"},"同程度",{"$f":"IF(LEFT(VLOOKUP(概要版1!D147,一覧表!$E:$X,9,FALSE),2)=\"低下\",\"■\",\"□\")","v":"□"},{"$f":"IF(LEFT(VLOOKUP(概要版1!D147,一覧表!$E:$X,9,FALSE),2)=\"低下\",VLOOKUP(概要版1!D147,一覧表!$E:$X,9,FALSE),\"低下\")","v":"低下"},{"$f":"VLOOKUP(概要版1!D147,一覧表!$E:$X,15,FALSE)","v":"B"}]
[null,null,null,"工程",{"$f":"IF(LEFT(VLOOKUP(概要版1!D147,一覧表!$E:$X,10,FALSE),2)=\"短縮\",\"■\",\"□\")","v":"■"},{"$f":"IF(LEFT(VLOOKUP(概要版1!D147,一覧表!$E:$X,10,FALSE),2)=\"短縮\",VLOOKUP(概要版1!D147,一覧表!$E:$X,10,FALSE),\"短縮\")","v":"短縮\n(75%)\n"},{"$f":"IF(VLOOKUP(概要版1!D147,一覧表!$E:$X,10,FALSE)=\"同程度\",\"■\",\"□\")","v":"□"},"同程度",{"$f":"IF(LEFT(VLOOKUP(概要版1!D147,一覧表!$E:$X,10,FALSE),2)=\"増加\",\"■\",\"□\")","v":"□"},{"$f":"IF(LEFT(VLOOKUP(概要版1!D147,一覧表!$E:$X,10,FALSE),2)=\"増加\",VLOOKUP(概要版1!D147,一覧表!$E:$X,10,FALSE),\"増加\")","v":"増加"},{"$f":"VLOOKUP(概要版1!D147,一覧表!$E:$X,16,FALSE)","v":"B"}]
[null,null,null,"品質",{"$f":"IF(VLOOKUP(概要版1!D147,一覧表!$E:$X,11,FALSE)=\"向上\",\"■\",\"□\")","v":"■"},"向上",{"$f":"IF(VLOOKUP(概要版1!D147,一覧表!$E:$X,11,FALSE)=\"同程度\",\"■\",\"□\")","v":"□"},"同程度",{"$f":"IF(VLOOKUP(概要版1!D147,一覧表!$E:$X,11,FALSE)=\"低下\",\"■\",\"□\")","v":"□"},"低下",{"$f":"VLOOKUP(概要版1!D147,一覧表!$E:$X,17,FALSE)","v":"C"}]
[null,null,null,"安全性",{"$f":"IF(VLOOKUP(概要版1!D147,一覧表!$E:$X,12,FALSE)=\"向上\",\"■\",\"□\")","v":"□"},"向上",{"$f":"IF(VLOOKUP(概要版1!D147,一覧表!$E:$X,12,FALSE)=\"同程度\",\"■\",\"□\")","v":"■"},"同程度",{"$f":"IF(VLOOKUP(概要版1!D147,一覧表!$E:$X,12,FALSE)=\"低下\",\"■\",\"□\")","v":"□"},"低下",{"$f":"VLOOKUP(概要版1!D147,一覧表!$E:$X,18,FALSE)","v":"C"}]
[null,null,null,"施工性",{"$f":"IF(VLOOKUP(概要版1!D147,一覧表!$E:$X,13,FALSE)=\"向上\",\"■\",\"□\")","v":"■"},"向上",{"$f":"IF(VLOOKUP(概要版1!D147,一覧表!$E:$X,13,FALSE)=\"同程度\",\"■\",\"□\")","v":"□"},"同程度",{"$f":"IF(VLOOKUP(概要版1!D147,一覧表!$E:$X,13,FALSE)=\"低下\",\"■\",\"□\")","v":"□"},"低下",{"$f":"VLOOKUP(概要版1!D147,一覧表!$E:$X,19,FALSE)","v":"B"}]
[null,null,null,"環境",{"$f":"IF(VLOOKUP(概要版1!D147,一覧表!$E:$X,14,FALSE)=\"向上\",\"■\",\"□\")","v":"■"},"向上",{"$f":"IF(VLOOKUP(概要版1!D147,一覧表!$E:$X,14,FALSE)=\"同程度\",\"■\",\"□\")","v":"□"},"同程度",{"$f":"IF(VLOOKUP(概要版1!D147,一覧表!$E:$X,14,FALSE)=\"低下\",\"■\",\"□\")","v":"□"},"低下",{"$f":"VLOOKUP(概要版1!D147,一覧表!$E:$X,20,FALSE)","v":"B"}]
[]
[]
[]
[]
[]
[null,{"$f":"D172","v":"QS-150017-VR"}]
[null,null,null,"QS-150017-VR",null,null,null,{"$f":"\"有用な技術の位置づけ：\"&VLOOKUP(D172,一覧表!$E:$G,3,FALSE)","v":"有用な技術の位置づけ：活用促進"},null,null,null,null,null,null,null,{"$f":"HYPERLINK(\"#一覧表!h\"&MATCH(D172,一覧表!E:E,0),\"一覧表に戻る\")","v":"一覧表に戻る"},{"$f":"Q147+1","v":8}]
[null,null,null,{"$f":"\"（工種 ： \"&VLOOKUP(D172,一覧表!$E:$AE,25,FALSE)&\"－\"&VLOOKUP(D172,一覧表!$E:$AE,26,FALSE)&\"－\"&IF(VLOOKUP(D172,一覧表!$E:$AE,27,FALSE)=\"\",\"　　　　　\",VLOOKUP(D172,一覧表!$E:$AE,27,FALSE))&\"）\"","v":"（工種 ： 道路維持修繕工－橋梁補修補強工－断面修復工）"}]
[]
[null,null,null,{"$f":"VLOOKUP(D172,一覧表!$E:$L,2,FALSE)","v":"コンクリート構造物の断面修復材料「ゴムラテシリーズ」"}]
[null,null,null,{"$f":"\"  副題 ： \"&VLOOKUP(D172,一覧表!$E:$AA,22,FALSE)","v":"  副題 ： プレミックス型超速硬ポリマーセメントモルタル・コンクリート"}]
[null,null,null,null,null,null,null,null,null,null,null,null,{"$f":"\"開発者名 ： \"&VLOOKUP(D172,一覧表!$E:$AA,23,FALSE)","v":"開発者名 ： 太平洋マテリアル株式会社 "}]
[]
[null,null,null,"概要、新規性及び期待される効果等",null,null,null,null,null,null,null,null,"図表等"]
[]
[null,null,null,{"$f":"VLOOKUP(D172,一覧表!$E:$L,7,FALSE)","v":"超速硬ポリマーセメントモルタルまたはコンクリートにより、劣化損傷したコンクリート構造物の断面修復を行う技術で、従来は、超速硬コンクリートで対応していた。本技術の活用により、乾燥収縮が小さく、付着性・耐久性に優れた断面修復が可能である。"}]
[null,null,null,"活用の効果"]
[null,null,null,{"$f":"\"比較する従来技術 ： \"&VLOOKUP(D172,一覧表!$E:$L,8,FALSE)","v":"比較する従来技術 ： 超速硬コンクリート"}]
[null,null,null,"項目","申請情報",null,null,null,null,null,"評価結果\n（C：同程度）"]
[null,null,null,"経済性",{"$f":"IF(LEFT(VLOOKUP(概要版1!D172,一覧表!$E:$X,9,FALSE),2)=\"向上\",\"■\",\"□\")","v":"■"},{"$f":"IF(LEFT(VLOOKUP(概要版1!D172,一覧表!$E:$X,9,FALSE),2)=\"向上\",VLOOKUP(概要版1!D172,一覧表!$E:$X,9,FALSE),\"向上\")","v":"向上\n(37%)\n"},{"$f":"IF(VLOOKUP(概要版1!D172,一覧表!$E:$X,9,FALSE)=\"同程度\",\"■\",\"□\")","v":"□"},"同程度",{"$f":"IF(LEFT(VLOOKUP(概要版1!D172,一覧表!$E:$X,9,FALSE),2)=\"低下\",\"■\",\"□\")","v":"□"},{"$f":"IF(LEFT(VLOOKUP(概要版1!D172,一覧表!$E:$X,9,FALSE),2)=\"低下\",VLOOKUP(概要版1!D172,一覧表!$E:$X,9,FALSE),\"低下\")","v":"低下"},{"$f":"VLOOKUP(概要版1!D172,一覧表!$E:$X,15,FALSE)","v":"B"}]
[null,null,null,"工程",{"$f":"IF(LEFT(VLOOKUP(概要版1!D172,一覧表!$E:$X,10,FALSE),2)=\"短縮\",\"■\",\"□\")","v":"■"},{"$f":"IF(LEFT(VLOOKUP(概要版1!D172,一覧表!$E:$X,10,FALSE),2)=\"短縮\",VLOOKUP(概要版1!D172,一覧表!$E:$X,10,FALSE),\"短縮\")","v":"短縮\n(33%)\n"},{"$f":"IF(VLOOKUP(概要版1!D172,一覧表!$E:$X,10,FALSE)=\"同程度\",\"■\",\"□\")","v":"□"},"同程度",{"$f":"IF(LEFT(VLOOKUP(概要版1!D172,一覧表!$E:$X,10,FALSE),2)=\"増加\",\"■\",\"□\")","v":"□"},{"$f":"IF(LEFT(VLOOKUP(概要版1!D172,一覧表!$E:$X,10,FALSE),2)=\"増加\",VLOOKUP(概要版1!D172,一覧表!$E:$X,10,FALSE),\"増加\")","v":"増加"},{"$f":"VLOOKUP(概要版1!D172,一覧表!$E:$X,16,FALSE)","v":"B"}]
[null,null,null,"品質",{"$f":"IF(VLOOKUP(概要版1!D172,一覧表!$E:$X,11,FALSE)=\"向上\",\"■\",\"□\")","v":"■"},"向上",{"$f":"IF(VLOOKUP(概要版1!D172,一覧表!$E:$X,11,FALSE)=\"同程度\",\"■\",\"□\")","v":"□"},"同程度",{"$f":"IF(VLOOKUP(概要版1!D172,一覧表!$E:$X,11,FALSE)=\"低下\",\"■\",\"□\")","v":"□"},"低下",{"$f":"VLOOKUP(概要版1!D172,一覧表!$E:$X,17,FALSE)","v":"B"}]
[null,null,null,"安全性",{"$f":"IF(VLOOKUP(概要版1!D172,一覧表!$E:$X,12,FALSE)=\"向上\",\"■\",\"□\")","v":"□"},"向上",{"$f":"IF(VLOOKUP(概要版1!D172,一覧表!$E:$X,12,FALSE)=\"同程度\",\"■\",\"□\")","v":"■"},"同程度",{"$f":"IF(VLOOKUP(概要版1!D172,一覧表!$E:$X,12,FALSE)=\"低下\",\"■\",\"□\")","v":"□"},"低下",{"$f":"VLOOKUP(概要版1!D172,一覧表!$E:$X,18,FALSE)","v":"C"}]
[null,null,null,"施工性",{"$f":"IF(VLOOKUP(概要版1!D172,一覧表!$E:$X,13,FALSE)=\"向上\",\"■\",\"□\")","v":"■"},"向上",{"$f":"IF(VLOOKUP(概要版1!D172,一覧表!$E:$X,13,FALSE)=\"同程度\",\"■\",\"□\")","v":"□"},"同程度",{"$f":"IF(VLOOKUP(概要版1!D172,一覧表!$E:$X,13,FALSE)=\"低下\",\"■\",\"□\")","v":"□"},"低下",{"$f":"VLOOKUP(概要版1!D172,一覧表!$E:$X,19,FALSE)","v":"B"}]
[null,null,null,"環境",{"$f":"IF(VLOOKUP(概要版1!D172,一覧表!$E:$X,14,FALSE)=\"向上\",\"■\",\"□\")","v":"■"},"向上",{"$f":"IF(VLOOKUP(概要版1!D172,一覧表!$E:$X,14,FALSE)=\"同程度\",\"■\",\"□\")","v":"□"},"同程度",{"$f":"IF(VLOOKUP(概要版1!D172,一覧表!$E:$X,14,FALSE)=\"低下\",\"■\",\"□\")","v":"□"},"低下",{"$f":"VLOOKUP(概要版1!D172,一覧表!$E:$X,20,FALSE)","v":"B"}]
[]
[]
[]
[]
[null,{"$f":"D196","v":"CB-120013-VR"}]
[null,null,null,"CB-120013-VR",null,null,null,{"$f":"\"有用な技術の位置づけ：\"&VLOOKUP(D196,一覧表!$E:$G,3,FALSE)","v":"有用な技術の位置づけ：活用促進"},null,null,null,null,null,null,null,{"$f":"HYPERLINK(\"#一覧表!h\"&MATCH(D196,一覧表!E:E,0),\"一覧表に戻る\")","v":"一覧表に戻る"},{"$f":"Q172+1","v":9}]
[null,null,null,{"$f":"\"（工種 ： \"&VLOOKUP(D196,一覧表!$E:$AE,25,FALSE)&\"－\"&VLOOKUP(D196,一覧表!$E:$AE,26,FALSE)&\"－\"&IF(VLOOKUP(D196,一覧表!$E:$AE,27,FALSE)=\"\",\"　　　　　\",VLOOKUP(D196,一覧表!$E:$AE,27,FALSE))&\"）\"","v":"（工種 ： 道路維持修繕工－橋梁補修補強工－表面保護工　）"}]
[]
[null,null,null,{"$f":"VLOOKUP(D196,一覧表!$E:$L,2,FALSE)","v":"ハイブリッド形表面被覆材アロンブルコートZ-X、Z-Y工法　"}]
[null,null,null,{"$f":"\"  副題 ： \"&VLOOKUP(D196,一覧表!$E:$AA,22,FALSE)","v":"  副題 ： 本工法は、工程短縮・品質向上・施工性にこだわって開発した材料(セメント系無機質硬化剤を主とし、アクリルゴムを混合)を用いる、コンクリート表面保護工法の新工法。"}]
[null,null,null,null,null,null,null,null,null,null,null,null,{"$f":"\"開発者名 ： \"&VLOOKUP(D196,一覧表!$E:$AA,23,FALSE)","v":"開発者名 ： 東亞合成株式会社、株式会社駒井ハルテック"}]
[]
[null,null,null,"概要、新規性及び期待される効果等",null,null,null,null,null,null,null,null,"図表等"]
[]
[null,null,null,{"$f":"VLOOKUP(D196,一覧表!$E:$L,7,FALSE)","v":"従来主流のコンクリート表面保護工は、エポキシ樹脂系材料であるが紫外線劣化により割れ剥がれが多く発生している。本工法は、コスト縮減・工程短縮・品質向上・施工性等に着目し開発した材料(セメント系無機質硬化材を主とし、アクリルゴムを混合)を用いる新工法である。 "}]
[null,null,null,"活用の効果"]
[null,null,null,{"$f":"\"比較する従来技術 ： \"&VLOOKUP(D196,一覧表!$E:$L,8,FALSE)","v":"比較する従来技術 ： エポキシ樹脂系表面被覆材を用いた剥落防止工法"}]
[null,null,null,"項目","申請情報",null,null,null,null,null,"評価結果\n（C：同程度）"]
[null,null,null,"経済性",{"$f":"IF(LEFT(VLOOKUP(概要版1!D196,一覧表!$E:$X,9,FALSE),2)=\"向上\",\"■\",\"□\")","v":"■"},{"$f":"IF(LEFT(VLOOKUP(概要版1!D196,一覧表!$E:$X,9,FALSE),2)=\"向上\",VLOOKUP(概要版1!D196,一覧表!$E:$X,9,FALSE),\"向上\")","v":"向上\n(8%)\n"},{"$f":"IF(VLOOKUP(概要版1!D196,一覧表!$E:$X,9,FALSE)=\"同程度\",\"■\",\"□\")","v":"□"},"同程度",{"$f":"IF(LEFT(VLOOKUP(概要版1!D196,一覧表!$E:$X,9,FALSE),2)=\"低下\",\"■\",\"□\")","v":"□"},{"$f":"IF(LEFT(VLOOKUP(概要版1!D196,一覧表!$E:$X,9,FALSE),2)=\"低下\",VLOOKUP(概要版1!D196,一覧表!$E:$X,9,FALSE),\"低下\")","v":"低下"},{"$f":"VLOOKUP(概要版1!D196,一覧表!$E:$X,15,FALSE)","v":"B"}]
[null,null,null,"工程",{"$f":"IF(LEFT(VLOOKUP(概要版1!D196,一覧表!$E:$X,10,FALSE),2)=\"短縮\",\"■\",\"□\")","v":"■"},{"$f":"IF(LEFT(VLOOKUP(概要版1!D196,一覧表!$E:$X,10,FALSE),2)=\"短縮\",VLOOKUP(概要版1!D196,一覧表!$E:$X,10,FALSE),\"短縮\")","v":"短縮\n(20%)\n"},{"$f":"IF(VLOOKUP(概要版1!D196,一覧表!$E:$X,10,FALSE)=\"同程度\",\"■\",\"□\")","v":"□"},"同程度",{"$f":"IF(LEFT(VLOOKUP(概要版1!D196,一覧表!$E:$X,10,FALSE),2)=\"増加\",\"■\",\"□\")","v":"□"},{"$f":"IF(LEFT(VLOOKUP(概要版1!D196,一覧表!$E:$X,10,FALSE),2)=\"増加\",VLOOKUP(概要版1!D196,一覧表!$E:$X,10,FALSE),\"増加\")","v":"増加"},{"$f":"VLOOKUP(概要版1!D196,一覧表!$E:$X,16,FALSE)","v":"B"}]
[null,null,null,"品質",{"$f":"IF(VLOOKUP(概要版1!D196,一覧表!$E:$X,11,FALSE)=\"向上\",\"■\",\"□\")","v":"■"},"向上",{"$f":"IF(VLOOKUP(概要版1!D196,一覧表!$E:$X,11,FALSE)=\"同程度\",\"■\",\"□\")","v":"□"},"同程度",{"$f":"IF(VLOOKUP(概要版1!D196,一覧表!$E:$X,11,FALSE)=\"低下\",\"■\",\"□\")","v":"□"},"低下",{"$f":"VLOOKUP(概要版1!D196,一覧表!$E:$X,17,FALSE)","v":"B"}]
[null,null,null,"安全性",{"$f":"IF(VLOOKUP(概要版1!D196,一覧表!$E:$X,12,FALSE)=\"向上\",\"■\",\"□\")","v":"■"},"向上",{"$f":"IF(VLOOKUP(概要版1!D196,一覧表!$E:$X,12,FALSE)=\"同程度\",\"■\",\"□\")","v":"□"},"同程度",{"$f":"IF(VLOOKUP(概要版1!D196,一覧表!$E:$X,12,FALSE)=\"低下\",\"■\",\"□\")","v":"□"},"低下",{"$f":"VLOOKUP(概要版1!D196,一覧表!$E:$X,18,FALSE)","v":"C"}]
[null,null,null,"施工性",{"$f":"IF(VLOOKUP(概要版1!D196,一覧表!$E:$X,13,FALSE)=\"向上\",\"■\",\"□\")","v":"■"},"向上",{"$f":"IF(VLOOKUP(概要版1!D196,一覧表!$E:$X,13,FALSE)=\"同程度\",\"■\",\"□\")","v":"□"},"同程度",{"$f":"IF(VLOOKUP(概要版1!D196,一覧表!$E:$X,13,FALSE)=\"低下\",\"■\",\"□\")","v":"□"},"低下",{"$f":"VLOOKUP(概要版1!D196,一覧表!$E:$X,19,FALSE)","v":"B"}]
[null,null,null,"環境",{"$f":"IF(VLOOKUP(概要版1!D196,一覧表!$E:$X,14,FALSE)=\"向上\",\"■\",\"□\")","v":"■"},"向上",{"$f":"IF(VLOOKUP(概要版1!D196,一覧表!$E:$X,14,FALSE)=\"同程度\",\"■\",\"□\")","v":"□"},"同程度",{"$f":"IF(VLOOKUP(概要版1!D196,一覧表!$E:$X,14,FALSE)=\"低下\",\"■\",\"□\")","v":"□"},"低下",{"$f":"VLOOKUP(概要版1!D196,一覧表!$E:$X,20,FALSE)","v":"B"}]
[]
[]
[]
[]
[null,{"$f":"D220","v":"KT-130009-VR"}]
[null,null,null,"KT-130009-VR",null,null,null,{"$f":"\"有用な技術の位置づけ：\"&VLOOKUP(D220,一覧表!$E:$G,3,FALSE)","v":"有用な技術の位置づけ：活用促進"},null,null,null,null,null,null,null,{"$f":"HYPERLINK(\"#一覧表!h\"&MATCH(D220,一覧表!E:E,0),\"一覧表に戻る\")","v":"一覧表に戻る"},{"$f":"Q196+1","v":10}]
[null,null,null,{"$f":"\"（工種 ： \"&VLOOKUP(D220,一覧表!$E:$AE,25,FALSE)&\"－\"&VLOOKUP(D220,一覧表!$E:$AE,26,FALSE)&\"－\"&IF(VLOOKUP(D220,一覧表!$E:$AE,27,FALSE)=\"\",\"　　　　　\",VLOOKUP(D220,一覧表!$E:$AE,27,FALSE))&\"）\"","v":"（工種 ： 道路維持修繕工－橋梁補修補強工－表面保護工）"}]
[]
[null,null,null,{"$f":"VLOOKUP(D220,一覧表!$E:$L,2,FALSE)","v":"シリケートガード"}]
[null,null,null,{"$f":"\"  副題 ： \"&VLOOKUP(D220,一覧表!$E:$AA,22,FALSE)","v":"  副題 ： コンクリート表面の緻密化により劣化を抑制し耐摩耗性を向上させるけい酸塩系表面含浸材"}]
[null,null,null,null,null,null,null,null,null,null,null,null,{"$f":"\"開発者名 ： \"&VLOOKUP(D220,一覧表!$E:$AA,23,FALSE)","v":"開発者名 ： ショーボンド建設株式会社 , 有限会社シモダ技術研究所 "}]
[]
[null,null,null,"概要、新規性及び期待される効果等",null,null,null,null,null,null,null,null,"図表等"]
[]
[null,null,null,{"$f":"VLOOKUP(D220,一覧表!$E:$L,7,FALSE)","v":"本技術は、施工時に反応促進剤を混合する2液性のけい酸塩系表面含浸材で、従来は1液性のけい酸塩系表面含浸材で対応していた。本技術の活用により、1回の塗布回数で施工できるため、施工性が良くなり、工期の短縮、経済性の向上が図れる。 "}]
[null,null,null,"活用の効果"]
[null,null,null,{"$f":"\"比較する従来技術 ： \"&VLOOKUP(D220,一覧表!$E:$L,8,FALSE)","v":"比較する従来技術 ： 1液性のけい酸塩系表面含浸材"}]
[null,null,null,"項目","申請情報",null,null,null,null,null,"評価結果\n（C：同程度）"]
[null,null,null,"経済性",{"$f":"IF(LEFT(VLOOKUP(概要版1!D220,一覧表!$E:$X,9,FALSE),2)=\"向上\",\"■\",\"□\")","v":"■"},{"$f":"IF(LEFT(VLOOKUP(概要版1!D220,一覧表!$E:$X,9,FALSE),2)=\"向上\",VLOOKUP(概要版1!D220,一覧表!$E:$X,9,FALSE),\"向上\")","v":"向上\n(50%)\n"},{"$f":"IF(VLOOKUP(概要版1!D220,一覧表!$E:$X,9,FALSE)=\"同程度\",\"■\",\"□\")","v":"□"},"同程度",{"$f":"IF(LEFT(VLOOKUP(概要版1!D220,一覧表!$E:$X,9,FALSE),2)=\"低下\",\"■\",\"□\")","v":"□"},{"$f":"IF(LEFT(VLOOKUP(概要版1!D220,一覧表!$E:$X,9,FALSE),2)=\"低下\",VLOOKUP(概要版1!D220,一覧表!$E:$X,9,FALSE),\"低下\")","v":"低下"},{"$f":"VLOOKUP(概要版1!D220,一覧表!$E:$X,15,FALSE)","v":"B"}]
[null,null,null,"工程",{"$f":"IF(LEFT(VLOOKUP(概要版1!D220,一覧表!$E:$X,10,FALSE),2)=\"短縮\",\"■\",\"□\")","v":"■"},{"$f":"IF(LEFT(VLOOKUP(概要版1!D220,一覧表!$E:$X,10,FALSE),2)=\"短縮\",VLOOKUP(概要版1!D220,一覧表!$E:$X,10,FALSE),\"短縮\")","v":"短縮\n(25%)\n"},{"$f":"IF(VLOOKUP(概要版1!D220,一覧表!$E:$X,10,FALSE)=\"同程度\",\"■\",\"□\")","v":"□"},"同程度",{"$f":"IF(LEFT(VLOOKUP(概要版1!D220,一覧表!$E:$X,10,FALSE),2)=\"増加\",\"■\",\"□\")","v":"□"},{"$f":"IF(LEFT(VLOOKUP(概要版1!D220,一覧表!$E:$X,10,FALSE),2)=\"増加\",VLOOKUP(概要版1!D220,一覧表!$E:$X,10,FALSE),\"増加\")","v":"増加"},{"$f":"VLOOKUP(概要版1!D220,一覧表!$E:$X,16,FALSE)","v":"B"}]
[null,null,null,"品質",{"$f":"IF(VLOOKUP(概要版1!D220,一覧表!$E:$X,11,FALSE)=\"向上\",\"■\",\"□\")","v":"■"},"向上",{"$f":"IF(VLOOKUP(概要版1!D220,一覧表!$E:$X,11,FALSE)=\"同程度\",\"■\",\"□\")","v":"□"},"同程度",{"$f":"IF(VLOOKUP(概要版1!D220,一覧表!$E:$X,11,FALSE)=\"低下\",\"■\",\"□\")","v":"□"},"低下",{"$f":"VLOOKUP(概要版1!D220,一覧表!$E:$X,17,FALSE)","v":"B"}]
[null,null,null,"安全性",{"$f":"IF(VLOOKUP(概要版1!D220,一覧表!$E:$X,12,FALSE)=\"向上\",\"■\",\"□\")","v":"□"},"向上",{"$f":"IF(VLOOKUP(概要版1!D220,一覧表!$E:$X,12,FALSE)=\"同程度\",\"■\",\"□\")","v":"■"},"同程度",{"$f":"IF(VLOOKUP(概要版1!D220,一覧表!$E:$X,12,FALSE)=\"低下\",\"■\",\"□\")","v":"□"},"低下",{"$f":"VLOOKUP(概要版1!D220,一覧表!$E:$X,18,FALSE)","v":"C"}]
[null,null,null,"施工性",{"$f":"IF(VLOOKUP(概要版1!D220,一覧表!$E:$X,13,FALSE)=\"向上\",\"■\",\"□\")","v":"■"},"向上",{"$f":"IF(VLOOKUP(概要版1!D220,一覧表!$E:$X,13,FALSE)=\"同程度\",\"■\",\"□\")","v":"□"},"同程度",{"$f":"IF(VLOOKUP(概要版1!D220,一覧表!$E:$X,13,FALSE)=\"低下\",\"■\",\"□\")","v":"□"},"低下",{"$f":"VLOOKUP(概要版1!D220,一覧表!$E:$X,19,FALSE)","v":"B"}]
[null,null,null,"環境",{"$f":"IF(VLOOKUP(概要版1!D220,一覧表!$E:$X,14,FALSE)=\"向上\",\"■\",\"□\")","v":"□"},"向上",{"$f":"IF(VLOOKUP(概要版1!D220,一覧表!$E:$X,14,FALSE)=\"同程度\",\"■\",\"□\")","v":"■"},"同程度",{"$f":"IF(VLOOKUP(概要版1!D220,一覧表!$E:$X,14,FALSE)=\"低下\",\"■\",\"□\")","v":"□"},"低下",{"$f":"VLOOKUP(概要版1!D220,一覧表!$E:$X,20,FALSE)","v":"C"}]
[]
[]
[]
[]
[null,{"$f":"D244","v":"KT-120082-VR"}]
[null,null,null,"KT-120082-VR",null,null,null,{"$f":"\"有用な技術の位置づけ：\"&VLOOKUP(D244,一覧表!$E:$G,3,FALSE)","v":"有用な技術の位置づけ：活用促進"},null,null,null,null,null,null,null,{"$f":"HYPERLINK(\"#一覧表!h\"&MATCH(D244,一覧表!E:E,0),\"一覧表に戻る\")","v":"一覧表に戻る"},{"$f":"Q220+1","v":11}]
[null,null,null,{"$f":"\"（工種 ： \"&VLOOKUP(D244,一覧表!$E:$AE,25,FALSE)&\"－\"&VLOOKUP(D244,一覧表!$E:$AE,26,FALSE)&\"－\"&IF(VLOOKUP(D244,一覧表!$E:$AE,27,FALSE)=\"\",\"　　　　　\",VLOOKUP(D244,一覧表!$E:$AE,27,FALSE))&\"）\"","v":"（工種 ： 道路維持修繕工－橋梁補修補強工－表面保護工）"}]
[]
[null,null,null,{"$f":"VLOOKUP(D244,一覧表!$E:$L,2,FALSE)","v":"ワンステップガード工法"}]
[null,null,null,{"$f":"\"  副題 ： \"&VLOOKUP(D244,一覧表!$E:$AA,22,FALSE)","v":"  副題 ： 短繊維混合樹脂によるコンクリート片はく落防止対策工法"}]
[null,null,null,null,null,null,null,null,null,null,null,null,{"$f":"\"開発者名 ： \"&VLOOKUP(D244,一覧表!$E:$AA,23,FALSE)","v":"開発者名 ： 電気化学工業株式会社 "}]
[]
[null,null,null,"概要、新規性及び期待される効果等",null,null,null,null,null,null,null,null,"図表等"]
[]
[null,null,null,{"$f":"VLOOKUP(D244,一覧表!$E:$L,7,FALSE)","v":"本技術は、特殊有機短繊維を混合したアクリル樹脂を塗布する方式のコンクリート片はく落防止対策工法で、従来は繊維シート接着工法で対応していた。本技術の活用により、シート接着工程が削減ができるので、工程の短縮、経済性の向上が図れる。"}]
[null,null,null,"活用の効果"]
[null,null,null,{"$f":"\"比較する従来技術 ： \"&VLOOKUP(D244,一覧表!$E:$L,8,FALSE)","v":"比較する従来技術 ： 繊維シート接着工法 "}]
[null,null,null,"項目","申請情報",null,null,null,null,null,"評価結果\n（C：同程度）"]
[null,null,null,"経済性",{"$f":"IF(LEFT(VLOOKUP(概要版1!D244,一覧表!$E:$X,9,FALSE),2)=\"向上\",\"■\",\"□\")","v":"■"},{"$f":"IF(LEFT(VLOOKUP(概要版1!D244,一覧表!$E:$X,9,FALSE),2)=\"向上\",VLOOKUP(概要版1!D244,一覧表!$E:$X,9,FALSE),\"向上\")","v":"向上\n(28%)\n"},{"$f":"IF(VLOOKUP(概要版1!D244,一覧表!$E:$X,9,FALSE)=\"同程度\",\"■\",\"□\")","v":"□"},"同程度",{"$f":"IF(LEFT(VLOOKUP(概要版1!D244,一覧表!$E:$X,9,FALSE),2)=\"低下\",\"■\",\"□\")","v":"□"},{"$f":"IF(LEFT(VLOOKUP(概要版1!D244,一覧表!$E:$X,9,FALSE),2)=\"低下\",VLOOKUP(概要版1!D244,一覧表!$E:$X,9,FALSE),\"低下\")","v":"低下"},{"$f":"VLOOKUP(概要版1!D244,一覧表!$E:$X,15,FALSE)","v":"B"}]
[null,null,null,"工程",{"$f":"IF(LEFT(VLOOKUP(概要版1!D244,一覧表!$E:$X,10,FALSE),2)=\"短縮\",\"■\",\"□\")","v":"■"},{"$f":"IF(LEFT(VLOOKUP(概要版1!D244,一覧表!$E:$X,10,FALSE),2)=\"短縮\",VLOOKUP(概要版1!D244,一覧表!$E:$X,10,FALSE),\"短縮\")","v":"短縮\n(58%)\n"},{"$f":"IF(VLOOKUP(概要版1!D244,一覧表!$E:$X,10,FALSE)=\"同程度\",\"■\",\"□\")","v":"□"},"同程度",{"$f":"IF(LEFT(VLOOKUP(概要版1!D244,一覧表!$E:$X,10,FALSE),2)=\"増加\",\"■\",\"□\")","v":"□"},{"$f":"IF(LEFT(VLOOKUP(概要版1!D244,一覧表!$E:$X,10,FALSE),2)=\"増加\",VLOOKUP(概要版1!D244,一覧表!$E:$X,10,FALSE),\"増加\")","v":"増加"},{"$f":"VLOOKUP(概要版1!D244,一覧表!$E:$X,16,FALSE)","v":"B"}]
[null,null,null,"品質",{"$f":"IF(VLOOKUP(概要版1!D244,一覧表!$E:$X,11,FALSE)=\"向上\",\"■\",\"□\")","v":"□"},"向上",{"$f":"IF(VLOOKUP(概要版1!D244,一覧表!$E:$X,11,FALSE)=\"同程度\",\"■\",\"□\")","v":"■"},"同程度",{"$f":"IF(VLOOKUP(概要版1!D244,一覧表!$E:$X,11,FALSE)=\"低下\",\"■\",\"□\")","v":"□"},"低下",{"$f":"VLOOKUP(概要版1!D244,一覧表!$E:$X,17,FALSE)","v":"C"}]
[null,null,null,"安全性",{"$f":"IF(VLOOKUP(概要版1!D244,一覧表!$E:$X,12,FALSE)=\"向上\",\"■\",\"□\")","v":"□"},"向上",{"$f":"IF(VLOOKUP(概要版1!D244,一覧表!$E:$X,12,FALSE)=\"同程度\",\"■\",\"□\")","v":"■"},"同程度",{"$f":"IF(VLOOKUP(概要版1!D244,一覧表!$E:$X,12,FALSE)=\"低下\",\"■\",\"□\")","v":"□"},"低下",{"$f":"VLOOKUP(概要版1!D244,一覧表!$E:$X,18,FALSE)","v":"B"}]
[null,null,null,"施工性",{"$f":"IF(VLOOKUP(概要版1!D244,一覧表!$E:$X,13,FALSE)=\"向上\",\"■\",\"□\")","v":"□"},"向上",{"$f":"IF(VLOOKUP(概要版1!D244,一覧表!$E:$X,13,FALSE)=\"同程度\",\"■\",\"□\")","v":"■"},"同程度",{"$f":"IF(VLOOKUP(概要版1!D244,一覧表!$E:$X,13,FALSE)=\"低下\",\"■\",\"□\")","v":"□"},"低下",{"$f":"VLOOKUP(概要版1!D244,一覧表!$E:$X,19,FALSE)","v":"B"}]
[null,null,null,"環境",{"$f":"IF(VLOOKUP(概要版1!D244,一覧表!$E:$X,14,FALSE)=\"向上\",\"■\",\"□\")","v":"■"},"向上",{"$f":"IF(VLOOKUP(概要版1!D244,一覧表!$E:$X,14,FALSE)=\"同程度\",\"■\",\"□\")","v":"□"},"同程度",{"$f":"IF(VLOOKUP(概要版1!D244,一覧表!$E:$X,14,FALSE)=\"低下\",\"■\",\"□\")","v":"□"},"低下",{"$f":"VLOOKUP(概要版1!D244,一覧表!$E:$X,20,FALSE)","v":"C"}]
[]
[]
[]
[]
[null,{"$f":"D268","v":"CG-120025-VE"}]
[null,null,null,"CG-120025-VE",null,null,null,{"$f":"\"有用な技術の位置づけ：\"&VLOOKUP(D268,一覧表!$E:$G,3,FALSE)","v":"有用な技術の位置づけ：活用促進"},null,null,null,null,null,null,null,{"$f":"HYPERLINK(\"#一覧表!h\"&MATCH(D268,一覧表!E:E,0),\"一覧表に戻る\")","v":"一覧表に戻る"},{"$f":"Q244+1","v":12}]
[null,null,null,{"$f":"\"（工種 ： \"&VLOOKUP(D268,一覧表!$E:$AE,25,FALSE)&\"－\"&VLOOKUP(D268,一覧表!$E:$AE,26,FALSE)&\"－\"&IF(VLOOKUP(D268,一覧表!$E:$AE,27,FALSE)=\"\",\"　　　　　\",VLOOKUP(D268,一覧表!$E:$AE,27,FALSE))&\"）\"","v":"（工種 ： 道路維持修繕工－橋梁補修補強工－新素材繊維接着工　）"}]
[]
[null,null,null,{"$f":"VLOOKUP(D268,一覧表!$E:$L,2,FALSE)","v":"超薄膜スケルトンはく落防災コーティング"}]
[null,null,null,{"$f":"\"  副題 ： \"&VLOOKUP(D268,一覧表!$E:$AA,22,FALSE)","v":"  副題 ： 透明特殊コーティング材とガラス連続繊維シートの含浸接着による、透けて見えるコンクリート構造物のはく落防止機能(繊維シートを使用しない場合は小片はく落防止機能)付き表面保護工法"}]
[null,null,null,null,null,null,null,null,null,null,null,null,{"$f":"\"開発者名 ： \"&VLOOKUP(D268,一覧表!$E:$AA,23,FALSE)","v":"開発者名 ： 株式会社エムビーエス"}]
[]
[null,null,null,"概要、新規性及び期待される効果等",null,null,null,null,null,null,null,null,"図表等"]
[]
[null,null,null,{"$f":"VLOOKUP(D268,一覧表!$E:$L,7,FALSE)","v":"透明特殊コーティング材とガラス連続繊維シートの含浸接着による、透けて見えるコンクリート構造物のはく落防止機能付き表面保護工法(繊維シートを使用しない場合は小片はく落防止機能)。塗膜の超薄膜化によってコーティング材の使用量を抑え経済性の向上を果たした。"}]
[null,null,null,"活用の効果"]
[null,null,null,{"$f":"\"比較する従来技術 ： \"&VLOOKUP(D268,一覧表!$E:$L,8,FALSE)","v":"比較する従来技術 ： ビニロン繊維シート工法"}]
[null,null,null,"項目","申請情報",null,null,null,null,null,"評価結果\n（C：同程度）"]
[null,null,null,"経済性",{"$f":"IF(LEFT(VLOOKUP(概要版1!D268,一覧表!$E:$X,9,FALSE),2)=\"向上\",\"■\",\"□\")","v":"■"},{"$f":"IF(LEFT(VLOOKUP(概要版1!D268,一覧表!$E:$X,9,FALSE),2)=\"向上\",VLOOKUP(概要版1!D268,一覧表!$E:$X,9,FALSE),\"向上\")","v":"向上\n(4%)\n"},{"$f":"IF(VLOOKUP(概要版1!D268,一覧表!$E:$X,9,FALSE)=\"同程度\",\"■\",\"□\")","v":"□"},"同程度",{"$f":"IF(LEFT(VLOOKUP(概要版1!D268,一覧表!$E:$X,9,FALSE),2)=\"低下\",\"■\",\"□\")","v":"□"},{"$f":"IF(LEFT(VLOOKUP(概要版1!D268,一覧表!$E:$X,9,FALSE),2)=\"低下\",VLOOKUP(概要版1!D268,一覧表!$E:$X,9,FALSE),\"低下\")","v":"低下"},{"$f":"VLOOKUP(概要版1!D268,一覧表!$E:$X,15,FALSE)","v":"B"}]
[null,null,null,"工程",{"$f":"IF(LEFT(VLOOKUP(概要版1!D268,一覧表!$E:$X,10,FALSE),2)=\"短縮\",\"■\",\"□\")","v":"■"},{"$f":"IF(LEFT(VLOOKUP(概要版1!D268,一覧表!$E:$X,10,FALSE),2)=\"短縮\",VLOOKUP(概要版1!D268,一覧表!$E:$X,10,FALSE),\"短縮\")","v":"短縮\n(33%)\n"},{"$f":"IF(VLOOKUP(概要版1!D268,一覧表!$E:$X,10,FALSE)=\"同程度\",\"■\",\"□\")","v":"□"},"同程度",{"$f":"IF(LEFT(VLOOKUP(概要版1!D268,一覧表!$E:$X,10,FALSE),2)=\"増加\",\"■\",\"□\")","v":"□"},{"$f":"IF(LEFT(VLOOKUP(概要版1!D268,一覧表!$E:$X,10,FALSE),2)=\"増加\",VLOOKUP(概要版1!D268,一覧表!$E:$X,10,FALSE),\"増加\")","v":"増加"},{"$f":"VLOOKUP(概要版1!D268,一覧表!$E:$X,16,FALSE)","v":"B"}]
[null,null,null,"品質",{"$f":"IF(VLOOKUP(概要版1!D268,一覧表!$E:$X,11,FALSE)=\"向上\",\"■\",\"□\")","v":"■"},"向上",{"$f":"IF(VLOOKUP(概要版1!D268,一覧表!$E:$X,11,FALSE)=\"同程度\",\"■\",\"□\")","v":"□"},"同程度",{"$f":"IF(VLOOKUP(概要版1!D268,一覧表!$E:$X,11,FALSE)=\"低下\",\"■\",\"□\")","v":"□"},"低下",{"$f":"VLOOKUP(概要版1!D268,一覧表!$E:$X,17,FALSE)","v":"B"}]
[null,null,null,"安全性",{"$f":"IF(VLOOKUP(概要版1!D268,一覧表!$E:$X,12,FALSE)=\"向上\",\"■\",\"□\")","v":"□"},"向上",{"$f":"IF(VLOOKUP(概要版1!D268,一覧表!$E:$X,12,FALSE)=\"同程度\",\"■\",\"□\")","v":"■"},"同程度",{"$f":"IF(VLOOKUP(概要版1!D268,一覧表!$E:$X,12,FALSE)=\"低下\",\"■\",\"□\")","v":"□"},"低下",{"$f":"VLOOKUP(概要版1!D268,一覧表!$E:$X,18,FALSE)","v":"C"}]
[null,null,null,"施工性",{"$f":"IF(VLOOKUP(概要版1!D268,一覧表!$E:$X,13,FALSE)=\"向上\",\"■\",\"□\")","v":"■"},"向上",{"$f":"IF(VLOOKUP(概要版1!D268,一覧表!$E:$X,13,FALSE)=\"同程度\",\"■\",\"□\")","v":"□"},"同程度",{"$f":"IF(VLOOKUP(概要版1!D268,一覧表!$E:$X,13,FALSE)=\"低下\",\"■\",\"□\")","v":"□"},"低下",{"$f":"VLOOKUP(概要版1!D268,一覧表!$E:$X,19,FALSE)","v":"B"}]
[null,null,null,"環境",{"$f":"IF(VLOOKUP(概要版1!D268,一覧表!$E:$X,14,FALSE)=\"向上\",\"■\",\"□\")","v":"■"},"向上",{"$f":"IF(VLOOKUP(概要版1!D268,一覧表!$E:$X,14,FALSE)=\"同程度\",\"■\",\"□\")","v":"□"},"同程度",{"$f":"IF(VLOOKUP(概要版1!D268,一覧表!$E:$X,14,FALSE)=\"低下\",\"■\",\"□\")","v":"□"},"低下",{"$f":"VLOOKUP(概要版1!D268,一覧表!$E:$X,20,FALSE)","v":"C"}]
[]
[]
[]
[]
[null,{"$f":"D292","v":"KT-150081-VR"}]
[null,null,null,"KT-150081-VR",null,null,null,{"$f":"\"有用な技術の位置づけ：\"&VLOOKUP(D292,一覧表!$E:$G,3,FALSE)","v":"有用な技術の位置づけ：活用促進"},null,null,null,null,null,null,null,{"$f":"HYPERLINK(\"#一覧表!h\"&MATCH(D292,一覧表!E:E,0),\"一覧表に戻る\")","v":"一覧表に戻る"},{"$f":"Q268+1","v":13}]
[null,null,null,{"$f":"\"（工種 ： \"&VLOOKUP(D292,一覧表!$E:$AE,25,FALSE)&\"－\"&VLOOKUP(D292,一覧表!$E:$AE,26,FALSE)&\"－\"&IF(VLOOKUP(D292,一覧表!$E:$AE,27,FALSE)=\"\",\"　　　　　\",VLOOKUP(D292,一覧表!$E:$AE,27,FALSE))&\"）\"","v":"（工種 ： 道路維持修繕工－橋梁補修補強工－防食対策工）"}]
[]
[null,null,null,{"$f":"VLOOKUP(D292,一覧表!$E:$L,2,FALSE)","v":"EPP(エコ・ペイント・ピーリング)工法"}]
[null,null,null,{"$f":"\"  副題 ： \"&VLOOKUP(D292,一覧表!$E:$AA,22,FALSE)","v":"  副題 ： 水性塗膜剥離剤による塗膜の剥離工法"}]
[null,null,null,null,null,null,null,null,null,null,null,null,{"$f":"\"開発者名 ： \"&VLOOKUP(D292,一覧表!$E:$AA,23,FALSE)","v":"開発者名 ： JFEエンジニアリング株式会社 "}]
[]
[null,null,null,"概要、新規性及び期待される効果等",null,null,null,null,null,null,null,null,"図表等"]
[]
[null,null,null,{"$f":"VLOOKUP(D292,一覧表!$E:$L,7,FALSE)","v":"本技術は、水性剥離剤を、橋梁などの塗膜に塗布することで、塗膜を浮き上がらせ除去する工法です。従来はブラスト工法を用いていました。本技術の活用により、塗膜除去時の粉塵と騒音の発生を防止できます。塗膜に有害物質を含む場合は特に有効です。 "}]
[null,null,null,"活用の効果"]
[null,null,null,{"$f":"\"比較する従来技術 ： \"&VLOOKUP(D292,一覧表!$E:$L,8,FALSE)","v":"比較する従来技術 ： ブラスト工法 "}]
[null,null,null,"項目","申請情報",null,null,null,null,null,"評価結果\n（C：同程度）"]
[null,null,null,"経済性",{"$f":"IF(LEFT(VLOOKUP(概要版1!D292,一覧表!$E:$X,9,FALSE),2)=\"向上\",\"■\",\"□\")","v":"■"},{"$f":"IF(LEFT(VLOOKUP(概要版1!D292,一覧表!$E:$X,9,FALSE),2)=\"向上\",VLOOKUP(概要版1!D292,一覧表!$E:$X,9,FALSE),\"向上\")","v":"向上\n(48%)\n"},{"$f":"IF(VLOOKUP(概要版1!D292,一覧表!$E:$X,9,FALSE)=\"同程度\",\"■\",\"□\")","v":"□"},"同程度",{"$f":"IF(LEFT(VLOOKUP(概要版1!D292,一覧表!$E:$X,9,FALSE),2)=\"低下\",\"■\",\"□\")","v":"□"},{"$f":"IF(LEFT(VLOOKUP(概要版1!D292,一覧表!$E:$X,9,FALSE),2)=\"低下\",VLOOKUP(概要版1!D292,一覧表!$E:$X,9,FALSE),\"低下\")","v":"低下"},{"$f":"VLOOKUP(概要版1!D292,一覧表!$E:$X,15,FALSE)","v":"B"}]
[null,null,null,"工程",{"$f":"IF(LEFT(VLOOKUP(概要版1!D292,一覧表!$E:$X,10,FALSE),2)=\"短縮\",\"■\",\"□\")","v":"■"},{"$f":"IF(LEFT(VLOOKUP(概要版1!D292,一覧表!$E:$X,10,FALSE),2)=\"短縮\",VLOOKUP(概要版1!D292,一覧表!$E:$X,10,FALSE),\"短縮\")","v":"短縮\n(43%)\n"},{"$f":"IF(VLOOKUP(概要版1!D292,一覧表!$E:$X,10,FALSE)=\"同程度\",\"■\",\"□\")","v":"□"},"同程度",{"$f":"IF(LEFT(VLOOKUP(概要版1!D292,一覧表!$E:$X,10,FALSE),2)=\"増加\",\"■\",\"□\")","v":"□"},{"$f":"IF(LEFT(VLOOKUP(概要版1!D292,一覧表!$E:$X,10,FALSE),2)=\"増加\",VLOOKUP(概要版1!D292,一覧表!$E:$X,10,FALSE),\"増加\")","v":"増加"},{"$f":"VLOOKUP(概要版1!D292,一覧表!$E:$X,16,FALSE)","v":"B"}]
[null,null,null,"品質",{"$f":"IF(VLOOKUP(概要版1!D292,一覧表!$E:$X,11,FALSE)=\"向上\",\"■\",\"□\")","v":"□"},"向上",{"$f":"IF(VLOOKUP(概要版1!D292,一覧表!$E:$X,11,FALSE)=\"同程度\",\"■\",\"□\")","v":"□"},"同程度",{"$f":"IF(VLOOKUP(概要版1!D292,一覧表!$E:$X,11,FALSE)=\"低下\",\"■\",\"□\")","v":"■"},"低下",{"$f":"VLOOKUP(概要版1!D292,一覧表!$E:$X,17,FALSE)","v":"C"}]
[null,null,null,"安全性",{"$f":"IF(VLOOKUP(概要版1!D292,一覧表!$E:$X,12,FALSE)=\"向上\",\"■\",\"□\")","v":"■"},"向上",{"$f":"IF(VLOOKUP(概要版1!D292,一覧表!$E:$X,12,FALSE)=\"同程度\",\"■\",\"□\")","v":"□"},"同程度",{"$f":"IF(VLOOKUP(概要版1!D292,一覧表!$E:$X,12,FALSE)=\"低下\",\"■\",\"□\")","v":"□"},"低下",{"$f":"VLOOKUP(概要版1!D292,一覧表!$E:$X,18,FALSE)","v":"B"}]
[null,null,null,"施工性",{"$f":"IF(VLOOKUP(概要版1!D292,一覧表!$E:$X,13,FALSE)=\"向上\",\"■\",\"□\")","v":"□"},"向上",{"$f":"IF(VLOOKUP(概要版1!D292,一覧表!$E:$X,13,FALSE)=\"同程度\",\"■\",\"□\")","v":"■"},"同程度",{"$f":"IF(VLOOKUP(概要版1!D292,一覧表!$E:$X,13,FALSE)=\"低下\",\"■\",\"□\")","v":"□"},"低下",{"$f":"VLOOKUP(概要版1!D292,一覧表!$E:$X,19,FALSE)","v":"B"}]
[null,null,null,"環境",{"$f":"IF(VLOOKUP(概要版1!D292,一覧表!$E:$X,14,FALSE)=\"向上\",\"■\",\"□\")","v":"■"},"向上",{"$f":"IF(VLOOKUP(概要版1!D292,一覧表!$E:$X,14,FALSE)=\"同程度\",\"■\",\"□\")","v":"□"},"同程度",{"$f":"IF(VLOOKUP(概要版1!D292,一覧表!$E:$X,14,FALSE)=\"低下\",\"■\",\"□\")","v":"□"},"低下",{"$f":"VLOOKUP(概要版1!D292,一覧表!$E:$X,20,FALSE)","v":"B"}]
[]
[]
[]
[]
[null,{"$f":"D316","v":"QS-150032-VE"}]
[null,null,null,"QS-150032-VE",null,null,null,{"$f":"\"有用な技術の位置づけ：\"&VLOOKUP(D316,一覧表!$E:$G,3,FALSE)","v":"有用な技術の位置づけ：活用促進"},null,null,null,null,null,null,null,{"$f":"HYPERLINK(\"#一覧表!h\"&MATCH(D316,一覧表!E:E,0),\"一覧表に戻る\")","v":"一覧表に戻る"},{"$f":"Q292+1","v":14}]
[null,null,null,{"$f":"\"（工種 ： \"&VLOOKUP(D316,一覧表!$E:$AE,25,FALSE)&\"－\"&VLOOKUP(D316,一覧表!$E:$AE,26,FALSE)&\"－\"&IF(VLOOKUP(D316,一覧表!$E:$AE,27,FALSE)=\"\",\"　　　　　\",VLOOKUP(D316,一覧表!$E:$AE,27,FALSE))&\"）\"","v":"（工種 ： 道路維持修繕工－橋梁補修補強工－防食対策工）"}]
[]
[null,null,null,{"$f":"VLOOKUP(D316,一覧表!$E:$L,2,FALSE)","v":"循環式ハイブリッドブラストシステム"}]
[null,null,null,{"$f":"\"  副題 ： \"&VLOOKUP(D316,一覧表!$E:$AA,22,FALSE)","v":"  副題 ： 研削材の再利用および設備の車載対応が可能なブラスト工法"}]
[null,null,null,null,null,null,null,null,null,null,null,null,{"$f":"\"開発者名 ： \"&VLOOKUP(D316,一覧表!$E:$AA,23,FALSE)","v":"開発者名 ： 株式会社イヤマトータルブリッジサポート"}]
[]
[null,null,null,"概要、新規性及び期待される効果等",null,null,null,null,null,null,null,null,"図表等"]
[]
[null,null,null,{"$f":"VLOOKUP(D316,一覧表!$E:$L,7,FALSE)","v":"橋梁補修補強工等において、鋼構造物の素地調整(1種ケレン)やコンクリート劣化部のチッピングを行う循環式機能付ブラスト工法で、従来は、エアーブラストで対応していた。本技術の活用により、ケレンかすから研削材を吸引再利用できるため、産業廃棄物を削減できる。 "}]
[null,null,null,"活用の効果"]
[null,null,null,{"$f":"\"比較する従来技術 ： \"&VLOOKUP(D316,一覧表!$E:$L,8,FALSE)","v":"比較する従来技術 ： エアーブラスト(加圧式) "}]
[null,null,null,"項目","申請情報",null,null,null,null,null,"評価結果\n（C：同程度）"]
[null,null,null,"経済性",{"$f":"IF(LEFT(VLOOKUP(概要版1!D316,一覧表!$E:$X,9,FALSE),2)=\"向上\",\"■\",\"□\")","v":"■"},{"$f":"IF(LEFT(VLOOKUP(概要版1!D316,一覧表!$E:$X,9,FALSE),2)=\"向上\",VLOOKUP(概要版1!D316,一覧表!$E:$X,9,FALSE),\"向上\")","v":"向上\n(24%)\n"},{"$f":"IF(VLOOKUP(概要版1!D316,一覧表!$E:$X,9,FALSE)=\"同程度\",\"■\",\"□\")","v":"□"},"同程度",{"$f":"IF(LEFT(VLOOKUP(概要版1!D316,一覧表!$E:$X,9,FALSE),2)=\"低下\",\"■\",\"□\")","v":"□"},{"$f":"IF(LEFT(VLOOKUP(概要版1!D316,一覧表!$E:$X,9,FALSE),2)=\"低下\",VLOOKUP(概要版1!D316,一覧表!$E:$X,9,FALSE),\"低下\")","v":"低下"},{"$f":"VLOOKUP(概要版1!D316,一覧表!$E:$X,15,FALSE)","v":"B"}]
[null,null,null,"工程",{"$f":"IF(LEFT(VLOOKUP(概要版1!D316,一覧表!$E:$X,10,FALSE),2)=\"短縮\",\"■\",\"□\")","v":"■"},{"$f":"IF(LEFT(VLOOKUP(概要版1!D316,一覧表!$E:$X,10,FALSE),2)=\"短縮\",VLOOKUP(概要版1!D316,一覧表!$E:$X,10,FALSE),\"短縮\")","v":"短縮\n(29%)\n"},{"$f":"IF(VLOOKUP(概要版1!D316,一覧表!$E:$X,10,FALSE)=\"同程度\",\"■\",\"□\")","v":"□"},"同程度",{"$f":"IF(LEFT(VLOOKUP(概要版1!D316,一覧表!$E:$X,10,FALSE),2)=\"増加\",\"■\",\"□\")","v":"□"},{"$f":"IF(LEFT(VLOOKUP(概要版1!D316,一覧表!$E:$X,10,FALSE),2)=\"増加\",VLOOKUP(概要版1!D316,一覧表!$E:$X,10,FALSE),\"増加\")","v":"増加"},{"$f":"VLOOKUP(概要版1!D316,一覧表!$E:$X,16,FALSE)","v":"C"}]
[null,null,null,"品質",{"$f":"IF(VLOOKUP(概要版1!D316,一覧表!$E:$X,11,FALSE)=\"向上\",\"■\",\"□\")","v":"□"},"向上",{"$f":"IF(VLOOKUP(概要版1!D316,一覧表!$E:$X,11,FALSE)=\"同程度\",\"■\",\"□\")","v":"■"},"同程度",{"$f":"IF(VLOOKUP(概要版1!D316,一覧表!$E:$X,11,FALSE)=\"低下\",\"■\",\"□\")","v":"□"},"低下",{"$f":"VLOOKUP(概要版1!D316,一覧表!$E:$X,17,FALSE)","v":"C"}]
[null,null,null,"安全性",{"$f":"IF(VLOOKUP(概要版1!D316,一覧表!$E:$X,12,FALSE)=\"向上\",\"■\",\"□\")","v":"□"},"向上",{"$f":"IF(VLOOKUP(概要版1!D316,一覧表!$E:$X,12,FALSE)=\"同程度\",\"■\",\"□\")","v":"■"},"同程度",{"$f":"IF(VLOOKUP(概要版1!D316,一覧表!$E:$X,12,FALSE)=\"低下\",\"■\",\"□\")","v":"□"},"低下",{"$f":"VLOOKUP(概要版1!D316,一覧表!$E:$X,18,FALSE)","v":"C"}]
[null,null,null,"施工性",{"$f":"IF(VLOOKUP(概要版1!D316,一覧表!$E:$X,13,FALSE)=\"向上\",\"■\",\"□\")","v":"■"},"向上",{"$f":"IF(VLOOKUP(概要版1!D316,一覧表!$E:$X,13,FALSE)=\"同程度\",\"■\",\"□\")","v":"□"},"同程度",{"$f":"IF(VLOOKUP(概要版1!D316,一覧表!$E:$X,13,FALSE)=\"低下\",\"■\",\"□\")","v":"□"},"低下",{"$f":"VLOOKUP(概要版1!D316,一覧表!$E:$X,19,FALSE)","v":"B"}]
[null,null,null,"環境",{"$f":"IF(VLOOKUP(概要版1!D316,一覧表!$E:$X,14,FALSE)=\"向上\",\"■\",\"□\")","v":"■"},"向上",{"$f":"IF(VLOOKUP(概要版1!D316,一覧表!$E:$X,14,FALSE)=\"同程度\",\"■\",\"□\")","v":"□"},"同程度",{"$f":"IF(VLOOKUP(概要版1!D316,一覧表!$E:$X,14,FALSE)=\"低下\",\"■\",\"□\")","v":"□"},"低下",{"$f":"VLOOKUP(概要版1!D316,一覧表!$E:$X,20,FALSE)","v":"B"}]
[]
[]
[]
[]
[null,{"$f":"D340","v":"HK-160021-VE"}]
[null,null,null,"HK-160021-VE",null,null,null,{"$f":"\"有用な技術の位置づけ：\"&VLOOKUP(D340,一覧表!$E:$G,3,FALSE)","v":"有用な技術の位置づけ：活用促進"},null,null,null,null,null,null,null,{"$f":"HYPERLINK(\"#一覧表!h\"&MATCH(D340,一覧表!E:E,0),\"一覧表に戻る\")","v":"一覧表に戻る"},{"$f":"Q316+1","v":15}]
[null,null,null,{"$f":"\"（工種 ： \"&VLOOKUP(D340,一覧表!$E:$AE,25,FALSE)&\"－\"&VLOOKUP(D340,一覧表!$E:$AE,26,FALSE)&\"－\"&IF(VLOOKUP(D340,一覧表!$E:$AE,27,FALSE)=\"\",\"　　　　　\",VLOOKUP(D340,一覧表!$E:$AE,27,FALSE))&\"）\"","v":"（工種 ： 道路維持修繕工－橋梁補修補強工－防食対策工）"}]
[]
[null,null,null,{"$f":"VLOOKUP(D340,一覧表!$E:$L,2,FALSE)","v":"ECO-SCOP工法"}]
[null,null,null,{"$f":"\"  副題 ： \"&VLOOKUP(D340,一覧表!$E:$AA,22,FALSE)","v":"  副題 ： 分析用途の塗膜採取及び回収方法"}]
[null,null,null,null,null,null,null,null,null,null,null,null,{"$f":"\"開発者名 ： \"&VLOOKUP(D340,一覧表!$E:$AA,23,FALSE)","v":"開発者名 ： 防食塗装研究所 "}]
[]
[null,null,null,"概要、新規性及び期待される効果等",null,null,null,null,null,null,null,null,"図表等"]
[]
[null,null,null,{"$f":"VLOOKUP(D340,一覧表!$E:$L,7,FALSE)","v":"分析用途の塗膜採取の従来技術は、素地調整2種が用いられているが、本技術の採取用具を用いることで、塗膜の採取コスト、作業工程と日数を各段に低減し、塗膜に含む有害物質から作業員の安全と周辺環境の汚染および二次汚染廃棄物の発生が防止できる。 "}]
[null,null,null,"活用の効果"]
[null,null,null,{"$f":"\"比較する従来技術 ： \"&VLOOKUP(D340,一覧表!$E:$L,8,FALSE)","v":"比較する従来技術 ： 素地調整2種 "}]
[null,null,null,"項目","申請情報",null,null,null,null,null,"評価結果\n（C：同程度）"]
[null,null,null,"経済性",{"$f":"IF(LEFT(VLOOKUP(概要版1!D340,一覧表!$E:$X,9,FALSE),2)=\"向上\",\"■\",\"□\")","v":"■"},{"$f":"IF(LEFT(VLOOKUP(概要版1!D340,一覧表!$E:$X,9,FALSE),2)=\"向上\",VLOOKUP(概要版1!D340,一覧表!$E:$X,9,FALSE),\"向上\")","v":"向上\n(59%)\n"},{"$f":"IF(VLOOKUP(概要版1!D340,一覧表!$E:$X,9,FALSE)=\"同程度\",\"■\",\"□\")","v":"□"},"同程度",{"$f":"IF(LEFT(VLOOKUP(概要版1!D340,一覧表!$E:$X,9,FALSE),2)=\"低下\",\"■\",\"□\")","v":"□"},{"$f":"IF(LEFT(VLOOKUP(概要版1!D340,一覧表!$E:$X,9,FALSE),2)=\"低下\",VLOOKUP(概要版1!D340,一覧表!$E:$X,9,FALSE),\"低下\")","v":"低下"},{"$f":"VLOOKUP(概要版1!D340,一覧表!$E:$X,15,FALSE)","v":"B"}]
[null,null,null,"工程",{"$f":"IF(LEFT(VLOOKUP(概要版1!D340,一覧表!$E:$X,10,FALSE),2)=\"短縮\",\"■\",\"□\")","v":"■"},{"$f":"IF(LEFT(VLOOKUP(概要版1!D340,一覧表!$E:$X,10,FALSE),2)=\"短縮\",VLOOKUP(概要版1!D340,一覧表!$E:$X,10,FALSE),\"短縮\")","v":"短縮\n(82%)\n"},{"$f":"IF(VLOOKUP(概要版1!D340,一覧表!$E:$X,10,FALSE)=\"同程度\",\"■\",\"□\")","v":"□"},"同程度",{"$f":"IF(LEFT(VLOOKUP(概要版1!D340,一覧表!$E:$X,10,FALSE),2)=\"増加\",\"■\",\"□\")","v":"□"},{"$f":"IF(LEFT(VLOOKUP(概要版1!D340,一覧表!$E:$X,10,FALSE),2)=\"増加\",VLOOKUP(概要版1!D340,一覧表!$E:$X,10,FALSE),\"増加\")","v":"増加"},{"$f":"VLOOKUP(概要版1!D340,一覧表!$E:$X,16,FALSE)","v":"B"}]
[null,null,null,"品質",{"$f":"IF(VLOOKUP(概要版1!D340,一覧表!$E:$X,11,FALSE)=\"向上\",\"■\",\"□\")","v":"■"},"向上",{"$f":"IF(VLOOKUP(概要版1!D340,一覧表!$E:$X,11,FALSE)=\"同程度\",\"■\",\"□\")","v":"□"},"同程度",{"$f":"IF(VLOOKUP(概要版1!D340,一覧表!$E:$X,11,FALSE)=\"低下\",\"■\",\"□\")","v":"□"},"低下",{"$f":"VLOOKUP(概要版1!D340,一覧表!$E:$X,17,FALSE)","v":"C"}]
[null,null,null,"安全性",{"$f":"IF(VLOOKUP(概要版1!D340,一覧表!$E:$X,12,FALSE)=\"向上\",\"■\",\"□\")","v":"■"},"向上",{"$f":"IF(VLOOKUP(概要版1!D340,一覧表!$E:$X,12,FALSE)=\"同程度\",\"■\",\"□\")","v":"□"},"同程度",{"$f":"IF(VLOOKUP(概要版1!D340,一覧表!$E:$X,12,FALSE)=\"低下\",\"■\",\"□\")","v":"□"},"低下",{"$f":"VLOOKUP(概要版1!D340,一覧表!$E:$X,18,FALSE)","v":"B"}]
[null,null,null,"施工性",{"$f":"IF(VLOOKUP(概要版1!D340,一覧表!$E:$X,13,FALSE)=\"向上\",\"■\",\"□\")","v":"■"},"向上",{"$f":"IF(VLOOKUP(概要版1!D340,一覧表!$E:$X,13,FALSE)=\"同程度\",\"■\",\"□\")","v":"□"},"同程度",{"$f":"IF(VLOOKUP(概要版1!D340,一覧表!$E:$X,13,FALSE)=\"低下\",\"■\",\"□\")","v":"□"},"低下",{"$f":"VLOOKUP(概要版1!D340,一覧表!$E:$X,19,FALSE)","v":"B"}]
[null,null,null,"環境",{"$f":"IF(VLOOKUP(概要版1!D340,一覧表!$E:$X,14,FALSE)=\"向上\",\"■\",\"□\")","v":"■"},"向上",{"$f":"IF(VLOOKUP(概要版1!D340,一覧表!$E:$X,14,FALSE)=\"同程度\",\"■\",\"□\")","v":"□"},"同程度",{"$f":"IF(VLOOKUP(概要版1!D340,一覧表!$E:$X,14,FALSE)=\"低下\",\"■\",\"□\")","v":"□"},"低下",{"$f":"VLOOKUP(概要版1!D340,一覧表!$E:$X,20,FALSE)","v":"B"}]
[]
[]
[]
[]
[null,{"$f":"D364","v":"KT-120008-VE"}]
[null,null,null,"KT-120008-VE",null,null,null,{"$f":"\"有用な技術の位置づけ：\"&VLOOKUP(D364,一覧表!$E:$G,3,FALSE)","v":"有用な技術の位置づけ：活用促進"},null,null,null,null,null,null,null,{"$f":"HYPERLINK(\"#一覧表!h\"&MATCH(D364,一覧表!E:E,0),\"一覧表に戻る\")","v":"一覧表に戻る"},{"$f":"Q340+1","v":16}]
[null,null,null,{"$f":"\"（工種 ： \"&VLOOKUP(D364,一覧表!$E:$AE,25,FALSE)&\"－\"&VLOOKUP(D364,一覧表!$E:$AE,26,FALSE)&\"－\"&IF(VLOOKUP(D364,一覧表!$E:$AE,27,FALSE)=\"\",\"　　　　　\",VLOOKUP(D364,一覧表!$E:$AE,27,FALSE))&\"）\"","v":"（工種 ： 道路維持修繕工－橋梁補修補強工－その他）"}]
[]
[null,null,null,{"$f":"VLOOKUP(D364,一覧表!$E:$L,2,FALSE)","v":"コンパクト ストッパー (KCS)"}]
[null,null,null,{"$f":"\"  副題 ： \"&VLOOKUP(D364,一覧表!$E:$AA,22,FALSE)","v":"  副題 ： 橋梁用の上揚力対応型水平ストッパー"}]
[null,null,null,null,null,null,null,null,null,null,null,null,{"$f":"\"開発者名 ： \"&VLOOKUP(D364,一覧表!$E:$AA,23,FALSE)","v":"開発者名 ： 株式会社川金コアテック"}]
[]
[null,null,null,"概要、新規性及び期待される効果等",null,null,null,null,null,null,null,null,"図表等"]
[]
[null,null,null,{"$f":"VLOOKUP(D364,一覧表!$E:$L,7,FALSE)","v":"本技術は水平2方向及び上向き(上揚力)の地震力に抵抗する緩衝ゴム付き変位制限装置であり、従来は鋼製ブラケットによる変位制限装置により対応していた。本技術の活用により、上向き地震力に抵抗可能な構造としたことにより、地震時における品質の向上となる。 "}]
[null,null,null,"活用の効果"]
[null,null,null,{"$f":"\"比較する従来技術 ： \"&VLOOKUP(D364,一覧表!$E:$L,8,FALSE)","v":"比較する従来技術 ： 鋼製ブラケットによる変位制限装置。"}]
[null,null,null,"項目","申請情報",null,null,null,null,null,"評価結果\n（C：同程度）"]
[null,null,null,"経済性",{"$f":"IF(LEFT(VLOOKUP(概要版1!D364,一覧表!$E:$X,9,FALSE),2)=\"向上\",\"■\",\"□\")","v":"■"},{"$f":"IF(LEFT(VLOOKUP(概要版1!D364,一覧表!$E:$X,9,FALSE),2)=\"向上\",VLOOKUP(概要版1!D364,一覧表!$E:$X,9,FALSE),\"向上\")","v":"向上\n(5%)\n"},{"$f":"IF(VLOOKUP(概要版1!D364,一覧表!$E:$X,9,FALSE)=\"同程度\",\"■\",\"□\")","v":"□"},"同程度",{"$f":"IF(LEFT(VLOOKUP(概要版1!D364,一覧表!$E:$X,9,FALSE),2)=\"低下\",\"■\",\"□\")","v":"□"},{"$f":"IF(LEFT(VLOOKUP(概要版1!D364,一覧表!$E:$X,9,FALSE),2)=\"低下\",VLOOKUP(概要版1!D364,一覧表!$E:$X,9,FALSE),\"低下\")","v":"低下"},{"$f":"VLOOKUP(概要版1!D364,一覧表!$E:$X,15,FALSE)","v":"B"}]
[null,null,null,"工程",{"$f":"IF(LEFT(VLOOKUP(概要版1!D364,一覧表!$E:$X,10,FALSE),2)=\"短縮\",\"■\",\"□\")","v":"■"},{"$f":"IF(LEFT(VLOOKUP(概要版1!D364,一覧表!$E:$X,10,FALSE),2)=\"短縮\",VLOOKUP(概要版1!D364,一覧表!$E:$X,10,FALSE),\"短縮\")","v":"短縮\n(4%)\n"},{"$f":"IF(VLOOKUP(概要版1!D364,一覧表!$E:$X,10,FALSE)=\"同程度\",\"■\",\"□\")","v":"□"},"同程度",{"$f":"IF(LEFT(VLOOKUP(概要版1!D364,一覧表!$E:$X,10,FALSE),2)=\"増加\",\"■\",\"□\")","v":"□"},{"$f":"IF(LEFT(VLOOKUP(概要版1!D364,一覧表!$E:$X,10,FALSE),2)=\"増加\",VLOOKUP(概要版1!D364,一覧表!$E:$X,10,FALSE),\"増加\")","v":"増加"},{"$f":"VLOOKUP(概要版1!D364,一覧表!$E:$X,16,FALSE)","v":"B"}]
[null,null,null,"品質",{"$f":"IF(VLOOKUP(概要版1!D364,一覧表!$E:$X,11,FALSE)=\"向上\",\"■\",\"□\")","v":"■"},"向上",{"$f":"IF(VLOOKUP(概要版1!D364,一覧表!$E:$X,11,FALSE)=\"同程度\",\"■\",\"□\")","v":"□"},"同程度",{"$f":"IF(VLOOKUP(概要版1!D364,一覧表!$E:$X,11,FALSE)=\"低下\",\"■\",\"□\")","v":"□"},"低下",{"$f":"VLOOKUP(概要版1!D364,一覧表!$E:$X,17,FALSE)","v":"B"}]
[null,null,null,"安全性",{"$f":"IF(VLOOKUP(概要版1!D364,一覧表!$E:$X,12,FALSE)=\"向上\",\"■\",\"□\")","v":"□"},"向上",{"$f":"IF(VLOOKUP(概要版1!D364,一覧表!$E:$X,12,FALSE)=\"同程度\",\"■\",\"□\")","v":"■"},"同程度",{"$f":"IF(VLOOKUP(概要版1!D364,一覧表!$E:$X,12,FALSE)=\"低下\",\"■\",\"□\")","v":"□"},"低下",{"$f":"VLOOKUP(概要版1!D364,一覧表!$E:$X,18,FALSE)","v":"C"}]
[null,null,null,"施工性",{"$f":"IF(VLOOKUP(概要版1!D364,一覧表!$E:$X,13,FALSE)=\"向上\",\"■\",\"□\")","v":"■"},"向上",{"$f":"IF(VLOOKUP(概要版1!D364,一覧表!$E:$X,13,FALSE)=\"同程度\",\"■\",\"□\")","v":"□"},"同程度",{"$f":"IF(VLOOKUP(概要版1!D364,一覧表!$E:$X,13,FALSE)=\"低下\",\"■\",\"□\")","v":"□"},"低下",{"$f":"VLOOKUP(概要版1!D364,一覧表!$E:$X,19,FALSE)","v":"B"}]
[null,null,null,"環境",{"$f":"IF(VLOOKUP(概要版1!D364,一覧表!$E:$X,14,FALSE)=\"向上\",\"■\",\"□\")","v":"□"},"向上",{"$f":"IF(VLOOKUP(概要版1!D364,一覧表!$E:$X,14,FALSE)=\"同程度\",\"■\",\"□\")","v":"■"},"同程度",{"$f":"IF(VLOOKUP(概要版1!D364,一覧表!$E:$X,14,FALSE)=\"低下\",\"■\",\"□\")","v":"□"},"低下",{"$f":"VLOOKUP(概要版1!D364,一覧表!$E:$X,20,FALSE)","v":"C"}]
[]
[]
[]
[]
[null,{"$f":"D388","v":"SK-140006-VR"}]
[null,null,null,"SK-140006-VR",null,null,null,{"$f":"\"有用な技術の位置づけ：\"&VLOOKUP(D388,一覧表!$E:$G,3,FALSE)","v":"有用な技術の位置づけ：活用促進"},null,null,null,null,null,null,null,{"$f":"HYPERLINK(\"#一覧表!h\"&MATCH(D388,一覧表!E:E,0),\"一覧表に戻る\")","v":"一覧表に戻る"},{"$f":"Q364+1","v":17}]
[null,null,null,{"$f":"\"（工種 ： \"&VLOOKUP(D388,一覧表!$E:$AE,25,FALSE)&\"－\"&VLOOKUP(D388,一覧表!$E:$AE,26,FALSE)&\"－\"&IF(VLOOKUP(D388,一覧表!$E:$AE,27,FALSE)=\"\",\"　　　　　\",VLOOKUP(D388,一覧表!$E:$AE,27,FALSE))&\"）\"","v":"（工種 ： 道路維持修繕工－橋梁補修補強工－その他）"}]
[]
[null,null,null,{"$f":"VLOOKUP(D388,一覧表!$E:$L,2,FALSE)","v":"コンクリート剥落防止対策ネット工法"}]
[null,null,null,{"$f":"\"  副題 ： \"&VLOOKUP(D388,一覧表!$E:$AA,22,FALSE)","v":"  副題 ： メッシュシート(スマートメッシュ)によるコンクリート片の剥落防止対策工法"}]
[null,null,null,null,null,null,null,null,null,null,null,null,{"$f":"\"開発者名 ： \"&VLOOKUP(D388,一覧表!$E:$AA,23,FALSE)","v":"開発者名 ： 西日本高速道路エンジニアリング四国株式会社、株式会社西宮産業、有限会社マサクリーン"}]
[]
[null,null,null,"概要、新規性及び期待される効果等",null,null,null,null,null,null,null,null,"図表等"]
[]
[null,null,null,{"$f":"VLOOKUP(D388,一覧表!$E:$L,7,FALSE)","v":"本技術は、コンクリート片のはく落防止対策ネット工法で、従来のはつり・断面修復工法に比べ、本技術の活用により短期間で経済的に剥落防止が可能となり、施工後にはひび割れ等の目視観察ができる他、容易に部分補修が図れます。"}]
[null,null,null,"活用の効果"]
[null,null,null,{"$f":"\"比較する従来技術 ： \"&VLOOKUP(D388,一覧表!$E:$L,8,FALSE)","v":"比較する従来技術 ： はつり工+断面修復工法 "}]
[null,null,null,"項目","申請情報",null,null,null,null,null,"評価結果\n（C：同程度）"]
[null,null,null,"経済性",{"$f":"IF(LEFT(VLOOKUP(概要版1!D388,一覧表!$E:$X,9,FALSE),2)=\"向上\",\"■\",\"□\")","v":"■"},{"$f":"IF(LEFT(VLOOKUP(概要版1!D388,一覧表!$E:$X,9,FALSE),2)=\"向上\",VLOOKUP(概要版1!D388,一覧表!$E:$X,9,FALSE),\"向上\")","v":"向上\n(96%)\n"},{"$f":"IF(VLOOKUP(概要版1!D388,一覧表!$E:$X,9,FALSE)=\"同程度\",\"■\",\"□\")","v":"□"},"同程度",{"$f":"IF(LEFT(VLOOKUP(概要版1!D388,一覧表!$E:$X,9,FALSE),2)=\"低下\",\"■\",\"□\")","v":"□"},{"$f":"IF(LEFT(VLOOKUP(概要版1!D388,一覧表!$E:$X,9,FALSE),2)=\"低下\",VLOOKUP(概要版1!D388,一覧表!$E:$X,9,FALSE),\"低下\")","v":"低下"},{"$f":"VLOOKUP(概要版1!D388,一覧表!$E:$X,15,FALSE)","v":"B"}]
[null,null,null,"工程",{"$f":"IF(LEFT(VLOOKUP(概要版1!D388,一覧表!$E:$X,10,FALSE),2)=\"短縮\",\"■\",\"□\")","v":"■"},{"$f":"IF(LEFT(VLOOKUP(概要版1!D388,一覧表!$E:$X,10,FALSE),2)=\"短縮\",VLOOKUP(概要版1!D388,一覧表!$E:$X,10,FALSE),\"短縮\")","v":"短縮\n(80%)\n"},{"$f":"IF(VLOOKUP(概要版1!D388,一覧表!$E:$X,10,FALSE)=\"同程度\",\"■\",\"□\")","v":"□"},"同程度",{"$f":"IF(LEFT(VLOOKUP(概要版1!D388,一覧表!$E:$X,10,FALSE),2)=\"増加\",\"■\",\"□\")","v":"□"},{"$f":"IF(LEFT(VLOOKUP(概要版1!D388,一覧表!$E:$X,10,FALSE),2)=\"増加\",VLOOKUP(概要版1!D388,一覧表!$E:$X,10,FALSE),\"増加\")","v":"増加"},{"$f":"VLOOKUP(概要版1!D388,一覧表!$E:$X,16,FALSE)","v":"B"}]
[null,null,null,"品質",{"$f":"IF(VLOOKUP(概要版1!D388,一覧表!$E:$X,11,FALSE)=\"向上\",\"■\",\"□\")","v":"□"},"向上",{"$f":"IF(VLOOKUP(概要版1!D388,一覧表!$E:$X,11,FALSE)=\"同程度\",\"■\",\"□\")","v":"■"},"同程度",{"$f":"IF(VLOOKUP(概要版1!D388,一覧表!$E:$X,11,FALSE)=\"低下\",\"■\",\"□\")","v":"□"},"低下",{"$f":"VLOOKUP(概要版1!D388,一覧表!$E:$X,17,FALSE)","v":"C"}]
[null,null,null,"安全性",{"$f":"IF(VLOOKUP(概要版1!D388,一覧表!$E:$X,12,FALSE)=\"向上\",\"■\",\"□\")","v":"□"},"向上",{"$f":"IF(VLOOKUP(概要版1!D388,一覧表!$E:$X,12,FALSE)=\"同程度\",\"■\",\"□\")","v":"■"},"同程度",{"$f":"IF(VLOOKUP(概要版1!D388,一覧表!$E:$X,12,FALSE)=\"低下\",\"■\",\"□\")","v":"□"},"低下",{"$f":"VLOOKUP(概要版1!D388,一覧表!$E:$X,18,FALSE)","v":"C"}]
[null,null,null,"施工性",{"$f":"IF(VLOOKUP(概要版1!D388,一覧表!$E:$X,13,FALSE)=\"向上\",\"■\",\"□\")","v":"■"},"向上",{"$f":"IF(VLOOKUP(概要版1!D388,一覧表!$E:$X,13,FALSE)=\"同程度\",\"■\",\"□\")","v":"□"},"同程度",{"$f":"IF(VLOOKUP(概要版1!D388,一覧表!$E:$X,13,FALSE)=\"低下\",\"■\",\"□\")","v":"□"},"低下",{"$f":"VLOOKUP(概要版1!D388,一覧表!$E:$X,19,FALSE)","v":"B"}]
[null,null,null,"環境",{"$f":"IF(VLOOKUP(概要版1!D388,一覧表!$E:$X,14,FALSE)=\"向上\",\"■\",\"□\")","v":"■"},"向上",{"$f":"IF(VLOOKUP(概要版1!D388,一覧表!$E:$X,14,FALSE)=\"同程度\",\"■\",\"□\")","v":"□"},"同程度",{"$f":"IF(VLOOKUP(概要版1!D388,一覧表!$E:$X,14,FALSE)=\"低下\",\"■\",\"□\")","v":"□"},"低下",{"$f":"VLOOKUP(概要版1!D388,一覧表!$E:$X,20,FALSE)","v":"B"}]
[]
[]
[]
[]
[null,{"$f":"D412","v":"KK-120043-VE"}]
[null,null,null,"KK-120043-VE",null,null,null,{"$f":"\"有用な技術の位置づけ：\"&VLOOKUP(D412,一覧表!$E:$G,3,FALSE)","v":"有用な技術の位置づけ：活用促進"},null,null,null,null,null,null,null,{"$f":"HYPERLINK(\"#一覧表!h\"&MATCH(D412,一覧表!E:E,0),\"一覧表に戻る\")","v":"一覧表に戻る"},{"$f":"Q388+1","v":18}]
[null,null,null,{"$f":"\"（工種 ： \"&VLOOKUP(D412,一覧表!$E:$AE,25,FALSE)&\"－\"&VLOOKUP(D412,一覧表!$E:$AE,26,FALSE)&\"－\"&IF(VLOOKUP(D412,一覧表!$E:$AE,27,FALSE)=\"\",\"　　　　　\",VLOOKUP(D412,一覧表!$E:$AE,27,FALSE))&\"）\"","v":"（工種 ： 道路維持修繕工－トンネル補修補強工－漏水対策工）"}]
[]
[null,null,null,{"$f":"VLOOKUP(D412,一覧表!$E:$L,2,FALSE)","v":"アーチ・ドレン工法"}]
[null,null,null,{"$f":"\"  副題 ： \"&VLOOKUP(D412,一覧表!$E:$AA,22,FALSE)","v":"  副題 ： トンネル・ボックスカルバート・共同溝などの漏水対策工法"}]
[null,null,null,null,null,null,null,null,null,null,null,null,{"$f":"\"開発者名 ： \"&VLOOKUP(D412,一覧表!$E:$AA,23,FALSE)","v":"開発者名 ： ニホン・ドレン株式会社\n"}]
[]
[null,null,null,"概要、新規性及び期待される効果等",null,null,null,null,null,null,null,null,"図表等"]
[]
[null,null,null,{"$f":"VLOOKUP(D412,一覧表!$E:$L,7,FALSE)","v":"本技術はプラスチック製の成型された耐衝撃性を有する樋を壁面にアンカーボルトで固定する線導水で従来はゴム系の導水材をコンクリートはつりして埋め込んで使用していた。本技術の活用により経済性、難燃性を期待できます。 "}]
[null,null,null,"活用の効果"]
[null,null,null,{"$f":"\"比較する従来技術 ： \"&VLOOKUP(D412,一覧表!$E:$L,8,FALSE)","v":"比較する従来技術 ： 線導水工（ゴム系）\n"}]
[null,null,null,"項目","申請情報",null,null,null,null,null,"評価結果\n（C：同程度）"]
[null,null,null,"経済性",{"$f":"IF(LEFT(VLOOKUP(概要版1!D412,一覧表!$E:$X,9,FALSE),2)=\"向上\",\"■\",\"□\")","v":"■"},{"$f":"IF(LEFT(VLOOKUP(概要版1!D412,一覧表!$E:$X,9,FALSE),2)=\"向上\",VLOOKUP(概要版1!D412,一覧表!$E:$X,9,FALSE),\"向上\")","v":"向上\n(37%)\n"},{"$f":"IF(VLOOKUP(概要版1!D412,一覧表!$E:$X,9,FALSE)=\"同程度\",\"■\",\"□\")","v":"□"},"同程度",{"$f":"IF(LEFT(VLOOKUP(概要版1!D412,一覧表!$E:$X,9,FALSE),2)=\"低下\",\"■\",\"□\")","v":"□"},{"$f":"IF(LEFT(VLOOKUP(概要版1!D412,一覧表!$E:$X,9,FALSE),2)=\"低下\",VLOOKUP(概要版1!D412,一覧表!$E:$X,9,FALSE),\"低下\")","v":"低下"},{"$f":"VLOOKUP(概要版1!D412,一覧表!$E:$X,15,FALSE)","v":"B"}]
[null,null,null,"工程",{"$f":"IF(LEFT(VLOOKUP(概要版1!D412,一覧表!$E:$X,10,FALSE),2)=\"短縮\",\"■\",\"□\")","v":"■"},{"$f":"IF(LEFT(VLOOKUP(概要版1!D412,一覧表!$E:$X,10,FALSE),2)=\"短縮\",VLOOKUP(概要版1!D412,一覧表!$E:$X,10,FALSE),\"短縮\")","v":"短縮\n(60%)\n"},{"$f":"IF(VLOOKUP(概要版1!D412,一覧表!$E:$X,10,FALSE)=\"同程度\",\"■\",\"□\")","v":"□"},"同程度",{"$f":"IF(LEFT(VLOOKUP(概要版1!D412,一覧表!$E:$X,10,FALSE),2)=\"増加\",\"■\",\"□\")","v":"□"},{"$f":"IF(LEFT(VLOOKUP(概要版1!D412,一覧表!$E:$X,10,FALSE),2)=\"増加\",VLOOKUP(概要版1!D412,一覧表!$E:$X,10,FALSE),\"増加\")","v":"増加"},{"$f":"VLOOKUP(概要版1!D412,一覧表!$E:$X,16,FALSE)","v":"B"}]
[null,null,null,"品質",{"$f":"IF(VLOOKUP(概要版1!D412,一覧表!$E:$X,11,FALSE)=\"向上\",\"■\",\"□\")","v":"■"},"向上",{"$f":"IF(VLOOKUP(概要版1!D412,一覧表!$E:$X,11,FALSE)=\"同程度\",\"■\",\"□\")","v":"□"},"同程度",{"$f":"IF(VLOOKUP(概要版1!D412,一覧表!$E:$X,11,FALSE)=\"低下\",\"■\",\"□\")","v":"□"},"低下",{"$f":"VLOOKUP(概要版1!D412,一覧表!$E:$X,17,FALSE)","v":"B"}]
[null,null,null,"安全性",{"$f":"IF(VLOOKUP(概要版1!D412,一覧表!$E:$X,12,FALSE)=\"向上\",\"■\",\"□\")","v":"□"},"向上",{"$f":"IF(VLOOKUP(概要版1!D412,一覧表!$E:$X,12,FALSE)=\"同程度\",\"■\",\"□\")","v":"■"},"同程度",{"$f":"IF(VLOOKUP(概要版1!D412,一覧表!$E:$X,12,FALSE)=\"低下\",\"■\",\"□\")","v":"□"},"低下",{"$f":"VLOOKUP(概要版1!D412,一覧表!$E:$X,18,FALSE)","v":"C"}]
[null,null,null,"施工性",{"$f":"IF(VLOOKUP(概要版1!D412,一覧表!$E:$X,13,FALSE)=\"向上\",\"■\",\"□\")","v":"■"},"向上",{"$f":"IF(VLOOKUP(概要版1!D412,一覧表!$E:$X,13,FALSE)=\"同程度\",\"■\",\"□\")","v":"□"},"同程度",{"$f":"IF(VLOOKUP(概要版1!D412,一覧表!$E:$X,13,FALSE)=\"低下\",\"■\",\"□\")","v":"□"},"低下",{"$f":"VLOOKUP(概要版1!D412,一覧表!$E:$X,19,FALSE)","v":"B"}]
[null,null,null,"環境",{"$f":"IF(VLOOKUP(概要版1!D412,一覧表!$E:$X,14,FALSE)=\"向上\",\"■\",\"□\")","v":"■"},"向上",{"$f":"IF(VLOOKUP(概要版1!D412,一覧表!$E:$X,14,FALSE)=\"同程度\",\"■\",\"□\")","v":"□"},"同程度",{"$f":"IF(VLOOKUP(概要版1!D412,一覧表!$E:$X,14,FALSE)=\"低下\",\"■\",\"□\")","v":"□"},"低下",{"$f":"VLOOKUP(概要版1!D412,一覧表!$E:$X,20,FALSE)","v":"B"}]
[]
[]
[]
[]
[null,{"$f":"D436","v":"KT-120036-VE"}]
[null,null,null,"KT-120036-VE",null,null,null,{"$f":"\"有用な技術の位置づけ：\"&VLOOKUP(D436,一覧表!$E:$G,3,FALSE)","v":"有用な技術の位置づけ：活用促進"},null,null,null,null,null,null,null,{"$f":"HYPERLINK(\"#一覧表!h\"&MATCH(D436,一覧表!E:E,0),\"一覧表に戻る\")","v":"一覧表に戻る"},{"$f":"Q412+1","v":19}]
[null,null,null,{"$f":"\"（工種 ： \"&VLOOKUP(D436,一覧表!$E:$AE,25,FALSE)&\"－\"&VLOOKUP(D436,一覧表!$E:$AE,26,FALSE)&\"－\"&IF(VLOOKUP(D436,一覧表!$E:$AE,27,FALSE)=\"\",\"　　　　　\",VLOOKUP(D436,一覧表!$E:$AE,27,FALSE))&\"）\"","v":"（工種 ： 道路維持修繕工－トンネル補修補強工－その他）"}]
[]
[null,null,null,{"$f":"VLOOKUP(D436,一覧表!$E:$L,2,FALSE)","v":"かため太郎"}]
[null,null,null,{"$f":"\"  副題 ： \"&VLOOKUP(D436,一覧表!$E:$AA,22,FALSE)","v":"  副題 ： コンクリート構造物をワンプッシュで簡易に補修できる応急対策用スプレー缶補修材"}]
[null,null,null,null,null,null,null,null,null,null,null,null,{"$f":"\"開発者名 ： \"&VLOOKUP(D436,一覧表!$E:$AA,23,FALSE)","v":"開発者名 ： 東日本旅客鉄道株式会社、オバナヤ・セメンテックス株式会社"}]
[]
[null,null,null,"概要、新規性及び期待される効果等",null,null,null,null,null,null,null,null,"図表等"]
[]
[null,null,null,{"$f":"VLOOKUP(D436,一覧表!$E:$L,7,FALSE)","v":"本技術は、エポキシ樹脂スプレーによるコンクリート構造物の応急的補修材料で、従来は、ポリマーセメントはけ塗りで対応していた。本技術の活用により、従来技術の練混ぜやはけ塗りが不要なので、労務費減少と施工具経費がなくなることで、経済性の向上が期待できる。 "}]
[null,null,null,"活用の効果"]
[null,null,null,{"$f":"\"比較する従来技術 ： \"&VLOOKUP(D436,一覧表!$E:$L,8,FALSE)","v":"比較する従来技術 ： ポリマーセメントはけ塗り"}]
[null,null,null,"項目","申請情報",null,null,null,null,null,"評価結果\n（C：同程度）"]
[null,null,null,"経済性",{"$f":"IF(LEFT(VLOOKUP(概要版1!D436,一覧表!$E:$X,9,FALSE),2)=\"向上\",\"■\",\"□\")","v":"■"},{"$f":"IF(LEFT(VLOOKUP(概要版1!D436,一覧表!$E:$X,9,FALSE),2)=\"向上\",VLOOKUP(概要版1!D436,一覧表!$E:$X,9,FALSE),\"向上\")","v":"向上\n(39%)\n"},{"$f":"IF(VLOOKUP(概要版1!D436,一覧表!$E:$X,9,FALSE)=\"同程度\",\"■\",\"□\")","v":"□"},"同程度",{"$f":"IF(LEFT(VLOOKUP(概要版1!D436,一覧表!$E:$X,9,FALSE),2)=\"低下\",\"■\",\"□\")","v":"□"},{"$f":"IF(LEFT(VLOOKUP(概要版1!D436,一覧表!$E:$X,9,FALSE),2)=\"低下\",VLOOKUP(概要版1!D436,一覧表!$E:$X,9,FALSE),\"低下\")","v":"低下"},{"$f":"VLOOKUP(概要版1!D436,一覧表!$E:$X,15,FALSE)","v":"B"}]
[null,null,null,"工程",{"$f":"IF(LEFT(VLOOKUP(概要版1!D436,一覧表!$E:$X,10,FALSE),2)=\"短縮\",\"■\",\"□\")","v":"■"},{"$f":"IF(LEFT(VLOOKUP(概要版1!D436,一覧表!$E:$X,10,FALSE),2)=\"短縮\",VLOOKUP(概要版1!D436,一覧表!$E:$X,10,FALSE),\"短縮\")","v":"短縮\n(83%)\n"},{"$f":"IF(VLOOKUP(概要版1!D436,一覧表!$E:$X,10,FALSE)=\"同程度\",\"■\",\"□\")","v":"□"},"同程度",{"$f":"IF(LEFT(VLOOKUP(概要版1!D436,一覧表!$E:$X,10,FALSE),2)=\"増加\",\"■\",\"□\")","v":"□"},{"$f":"IF(LEFT(VLOOKUP(概要版1!D436,一覧表!$E:$X,10,FALSE),2)=\"増加\",VLOOKUP(概要版1!D436,一覧表!$E:$X,10,FALSE),\"増加\")","v":"増加"},{"$f":"VLOOKUP(概要版1!D436,一覧表!$E:$X,16,FALSE)","v":"A"}]
[null,null,null,"品質",{"$f":"IF(VLOOKUP(概要版1!D436,一覧表!$E:$X,11,FALSE)=\"向上\",\"■\",\"□\")","v":"■"},"向上",{"$f":"IF(VLOOKUP(概要版1!D436,一覧表!$E:$X,11,FALSE)=\"同程度\",\"■\",\"□\")","v":"□"},"同程度",{"$f":"IF(VLOOKUP(概要版1!D436,一覧表!$E:$X,11,FALSE)=\"低下\",\"■\",\"□\")","v":"□"},"低下",{"$f":"VLOOKUP(概要版1!D436,一覧表!$E:$X,17,FALSE)","v":"C"}]
[null,null,null,"安全性",{"$f":"IF(VLOOKUP(概要版1!D436,一覧表!$E:$X,12,FALSE)=\"向上\",\"■\",\"□\")","v":"□"},"向上",{"$f":"IF(VLOOKUP(概要版1!D436,一覧表!$E:$X,12,FALSE)=\"同程度\",\"■\",\"□\")","v":"■"},"同程度",{"$f":"IF(VLOOKUP(概要版1!D436,一覧表!$E:$X,12,FALSE)=\"低下\",\"■\",\"□\")","v":"□"},"低下",{"$f":"VLOOKUP(概要版1!D436,一覧表!$E:$X,18,FALSE)","v":"C"}]
[null,null,null,"施工性",{"$f":"IF(VLOOKUP(概要版1!D436,一覧表!$E:$X,13,FALSE)=\"向上\",\"■\",\"□\")","v":"■"},"向上",{"$f":"IF(VLOOKUP(概要版1!D436,一覧表!$E:$X,13,FALSE)=\"同程度\",\"■\",\"□\")","v":"□"},"同程度",{"$f":"IF(VLOOKUP(概要版1!D436,一覧表!$E:$X,13,FALSE)=\"低下\",\"■\",\"□\")","v":"□"},"低下",{"$f":"VLOOKUP(概要版1!D436,一覧表!$E:$X,19,FALSE)","v":"B"}]
[null,null,null,"環境",{"$f":"IF(VLOOKUP(概要版1!D436,一覧表!$E:$X,14,FALSE)=\"向上\",\"■\",\"□\")","v":"□"},"向上",{"$f":"IF(VLOOKUP(概要版1!D436,一覧表!$E:$X,14,FALSE)=\"同程度\",\"■\",\"□\")","v":"■"},"同程度",{"$f":"IF(VLOOKUP(概要版1!D436,一覧表!$E:$X,14,FALSE)=\"低下\",\"■\",\"□\")","v":"□"},"低下",{"$f":"VLOOKUP(概要版1!D436,一覧表!$E:$X,20,FALSE)","v":"C"}]
[]
[]
[]
[]
[null,{"$f":"D460","v":"KK-150047-VE"}]
[null,null,null,"KK-150047-VE",null,null,null,{"$f":"\"有用な技術の位置づけ：\"&VLOOKUP(D460,一覧表!$E:$G,3,FALSE)","v":"有用な技術の位置づけ：活用促進"},null,null,null,null,null,null,null,{"$f":"HYPERLINK(\"#一覧表!h\"&MATCH(D460,一覧表!E:E,0),\"一覧表に戻る\")","v":"一覧表に戻る"},{"$f":"Q436+1","v":20}]
[null,null,null,{"$f":"\"（工種 ： \"&VLOOKUP(D460,一覧表!$E:$AE,25,FALSE)&\"－\"&VLOOKUP(D460,一覧表!$E:$AE,26,FALSE)&\"－\"&IF(VLOOKUP(D460,一覧表!$E:$AE,27,FALSE)=\"\",\"　　　　　\",VLOOKUP(D460,一覧表!$E:$AE,27,FALSE))&\"）\"","v":"（工種 ： 道路維持修繕工－トンネル補修補強工－その他）"}]
[]
[null,null,null,{"$f":"VLOOKUP(D460,一覧表!$E:$L,2,FALSE)","v":"サイド・ドレンⅡ型工法"}]
[null,null,null,{"$f":"\"  副題 ： \"&VLOOKUP(D460,一覧表!$E:$AA,22,FALSE)","v":"  副題 ： トンネル縦断方向、橋梁上部からの漏水対策工法"}]
[null,null,null,null,null,null,null,null,null,null,null,null,{"$f":"\"開発者名 ： \"&VLOOKUP(D460,一覧表!$E:$AA,23,FALSE)","v":"開発者名 ： ニホン・ドレン株式会社"}]
[]
[null,null,null,"概要、新規性及び期待される効果等",null,null,null,null,null,null,null,null,"図表等"]
[]
[null,null,null,{"$f":"VLOOKUP(D460,一覧表!$E:$L,7,FALSE)","v":"本技術はトンネルや橋梁上部からの漏水等を硬質塩ビ製の横引樋を使用して漏水を延長方向に導く漏水対策工であり、従来はコンクリートをVカットし導水ホースを入れモルタル補修していた。本技術の活用により周辺環境へ影響の抑制、経済性、品質の向上が期待できる。"}]
[null,null,null,"活用の効果"]
[null,null,null,{"$f":"\"比較する従来技術 ： \"&VLOOKUP(D460,一覧表!$E:$L,8,FALSE)","v":"比較する従来技術 ： Vカット工法"}]
[null,null,null,"項目","申請情報",null,null,null,null,null,"評価結果\n（C：同程度）"]
[null,null,null,"経済性",{"$f":"IF(LEFT(VLOOKUP(概要版1!D460,一覧表!$E:$X,9,FALSE),2)=\"向上\",\"■\",\"□\")","v":"■"},{"$f":"IF(LEFT(VLOOKUP(概要版1!D460,一覧表!$E:$X,9,FALSE),2)=\"向上\",VLOOKUP(概要版1!D460,一覧表!$E:$X,9,FALSE),\"向上\")","v":"向上\n(43%)\n"},{"$f":"IF(VLOOKUP(概要版1!D460,一覧表!$E:$X,9,FALSE)=\"同程度\",\"■\",\"□\")","v":"□"},"同程度",{"$f":"IF(LEFT(VLOOKUP(概要版1!D460,一覧表!$E:$X,9,FALSE),2)=\"低下\",\"■\",\"□\")","v":"□"},{"$f":"IF(LEFT(VLOOKUP(概要版1!D460,一覧表!$E:$X,9,FALSE),2)=\"低下\",VLOOKUP(概要版1!D460,一覧表!$E:$X,9,FALSE),\"低下\")","v":"低下"},{"$f":"VLOOKUP(概要版1!D460,一覧表!$E:$X,15,FALSE)","v":"B"}]
[null,null,null,"工程",{"$f":"IF(LEFT(VLOOKUP(概要版1!D460,一覧表!$E:$X,10,FALSE),2)=\"短縮\",\"■\",\"□\")","v":"■"},{"$f":"IF(LEFT(VLOOKUP(概要版1!D460,一覧表!$E:$X,10,FALSE),2)=\"短縮\",VLOOKUP(概要版1!D460,一覧表!$E:$X,10,FALSE),\"短縮\")","v":"短縮\n(4%)\n"},{"$f":"IF(VLOOKUP(概要版1!D460,一覧表!$E:$X,10,FALSE)=\"同程度\",\"■\",\"□\")","v":"□"},"同程度",{"$f":"IF(LEFT(VLOOKUP(概要版1!D460,一覧表!$E:$X,10,FALSE),2)=\"増加\",\"■\",\"□\")","v":"□"},{"$f":"IF(LEFT(VLOOKUP(概要版1!D460,一覧表!$E:$X,10,FALSE),2)=\"増加\",VLOOKUP(概要版1!D460,一覧表!$E:$X,10,FALSE),\"増加\")","v":"増加"},{"$f":"VLOOKUP(概要版1!D460,一覧表!$E:$X,16,FALSE)","v":"B"}]
[null,null,null,"品質",{"$f":"IF(VLOOKUP(概要版1!D460,一覧表!$E:$X,11,FALSE)=\"向上\",\"■\",\"□\")","v":"■"},"向上",{"$f":"IF(VLOOKUP(概要版1!D460,一覧表!$E:$X,11,FALSE)=\"同程度\",\"■\",\"□\")","v":"□"},"同程度",{"$f":"IF(VLOOKUP(概要版1!D460,一覧表!$E:$X,11,FALSE)=\"低下\",\"■\",\"□\")","v":"□"},"低下",{"$f":"VLOOKUP(概要版1!D460,一覧表!$E:$X,17,FALSE)","v":"B"}]
[null,null,null,"安全性",{"$f":"IF(VLOOKUP(概要版1!D460,一覧表!$E:$X,12,FALSE)=\"向上\",\"■\",\"□\")","v":"□"},"向上",{"$f":"IF(VLOOKUP(概要版1!D460,一覧表!$E:$X,12,FALSE)=\"同程度\",\"■\",\"□\")","v":"■"},"同程度",{"$f":"IF(VLOOKUP(概要版1!D460,一覧表!$E:$X,12,FALSE)=\"低下\",\"■\",\"□\")","v":"□"},"低下",{"$f":"VLOOKUP(概要版1!D460,一覧表!$E:$X,18,FALSE)","v":"C"}]
[null,null,null,"施工性",{"$f":"IF(VLOOKUP(概要版1!D460,一覧表!$E:$X,13,FALSE)=\"向上\",\"■\",\"□\")","v":"□"},"向上",{"$f":"IF(VLOOKUP(概要版1!D460,一覧表!$E:$X,13,FALSE)=\"同程度\",\"■\",\"□\")","v":"■"},"同程度",{"$f":"IF(VLOOKUP(概要版1!D460,一覧表!$E:$X,13,FALSE)=\"低下\",\"■\",\"□\")","v":"□"},"低下",{"$f":"VLOOKUP(概要版1!D460,一覧表!$E:$X,19,FALSE)","v":"C"}]
[null,null,null,"環境",{"$f":"IF(VLOOKUP(概要版1!D460,一覧表!$E:$X,14,FALSE)=\"向上\",\"■\",\"□\")","v":"■"},"向上",{"$f":"IF(VLOOKUP(概要版1!D460,一覧表!$E:$X,14,FALSE)=\"同程度\",\"■\",\"□\")","v":"□"},"同程度",{"$f":"IF(VLOOKUP(概要版1!D460,一覧表!$E:$X,14,FALSE)=\"低下\",\"■\",\"□\")","v":"□"},"低下",{"$f":"VLOOKUP(概要版1!D460,一覧表!$E:$X,20,FALSE)","v":"B"}]
[]
[]
[]
[]
[null,{"$f":"D484","v":"HK-180003-VE"}]
[null,null,null,"HK-180003-VE",null,null,null,{"$f":"\"有用な技術の位置づけ：\"&VLOOKUP(D484,一覧表!$E:$G,3,FALSE)","v":"有用な技術の位置づけ：活用促進"},null,null,null,null,null,null,null,{"$f":"HYPERLINK(\"#一覧表!h\"&MATCH(D484,一覧表!E:E,0),\"一覧表に戻る\")","v":"一覧表に戻る"},{"$f":"Q460+1","v":21}]
[null,null,null,{"$f":"\"（工種 ： \"&VLOOKUP(D484,一覧表!$E:$AE,25,FALSE)&\"－\"&VLOOKUP(D484,一覧表!$E:$AE,26,FALSE)&\"－\"&IF(VLOOKUP(D484,一覧表!$E:$AE,27,FALSE)=\"\",\"　　　　　\",VLOOKUP(D484,一覧表!$E:$AE,27,FALSE))&\"）\"","v":"（工種 ： 道路維持修繕工－路面補修工－わだち掘れ補修工）"}]
[]
[null,null,null,{"$f":"VLOOKUP(D484,一覧表!$E:$L,2,FALSE)","v":"車載3Dスキャナを用いた舗装切削量等計算システム"}]
[null,null,null,{"$f":"\"  副題 ： \"&VLOOKUP(D484,一覧表!$E:$AA,22,FALSE)","v":"  副題 ： 安全に配慮したMMSによるわだち掘れの計測"}]
[null,null,null,null,null,null,null,null,null,null,null,null,{"$f":"\"開発者名 ： \"&VLOOKUP(D484,一覧表!$E:$AA,23,FALSE)","v":"開発者名 ： 大陸建設株式会社"}]
[]
[null,null,null,"概要、新規性及び期待される効果等",null,null,null,null,null,null,null,null,"図表等"]
[]
[null,null,null,{"$f":"VLOOKUP(D484,一覧表!$E:$L,7,FALSE)","v":"横断プロフィールメータによる測定をMMS(モービル・マッピング・システム)に変更して、路面のわだち掘れを計測し、舗装の切削量、オーバーレイの合材量を計算する。 本技術の活用により、コスト縮減、工程短縮、安全性の向上が期待できる。"}]
[null,null,null,"活用の効果"]
[null,null,null,{"$f":"\"比較する従来技術 ： \"&VLOOKUP(D484,一覧表!$E:$L,8,FALSE)","v":"比較する従来技術 ： 横断プロフィールメータによる計測"}]
[null,null,null,"項目","申請情報",null,null,null,null,null,"評価結果\n（C：同程度）"]
[null,null,null,"経済性",{"$f":"IF(LEFT(VLOOKUP(概要版1!D484,一覧表!$E:$X,9,FALSE),2)=\"向上\",\"■\",\"□\")","v":"■"},{"$f":"IF(LEFT(VLOOKUP(概要版1!D484,一覧表!$E:$X,9,FALSE),2)=\"向上\",VLOOKUP(概要版1!D484,一覧表!$E:$X,9,FALSE),\"向上\")","v":"向上\n(8%)\n"},{"$f":"IF(VLOOKUP(概要版1!D484,一覧表!$E:$X,9,FALSE)=\"同程度\",\"■\",\"□\")","v":"□"},"同程度",{"$f":"IF(LEFT(VLOOKUP(概要版1!D484,一覧表!$E:$X,9,FALSE),2)=\"低下\",\"■\",\"□\")","v":"□"},{"$f":"IF(LEFT(VLOOKUP(概要版1!D484,一覧表!$E:$X,9,FALSE),2)=\"低下\",VLOOKUP(概要版1!D484,一覧表!$E:$X,9,FALSE),\"低下\")","v":"低下"},{"$f":"VLOOKUP(概要版1!D484,一覧表!$E:$X,15,FALSE)","v":"B"}]
[null,null,null,"工程",{"$f":"IF(LEFT(VLOOKUP(概要版1!D484,一覧表!$E:$X,10,FALSE),2)=\"短縮\",\"■\",\"□\")","v":"■"},{"$f":"IF(LEFT(VLOOKUP(概要版1!D484,一覧表!$E:$X,10,FALSE),2)=\"短縮\",VLOOKUP(概要版1!D484,一覧表!$E:$X,10,FALSE),\"短縮\")","v":"短縮\n(66%)\n"},{"$f":"IF(VLOOKUP(概要版1!D484,一覧表!$E:$X,10,FALSE)=\"同程度\",\"■\",\"□\")","v":"□"},"同程度",{"$f":"IF(LEFT(VLOOKUP(概要版1!D484,一覧表!$E:$X,10,FALSE),2)=\"増加\",\"■\",\"□\")","v":"□"},{"$f":"IF(LEFT(VLOOKUP(概要版1!D484,一覧表!$E:$X,10,FALSE),2)=\"増加\",VLOOKUP(概要版1!D484,一覧表!$E:$X,10,FALSE),\"増加\")","v":"増加"},{"$f":"VLOOKUP(概要版1!D484,一覧表!$E:$X,16,FALSE)","v":"A"}]
[null,null,null,"品質",{"$f":"IF(VLOOKUP(概要版1!D484,一覧表!$E:$X,11,FALSE)=\"向上\",\"■\",\"□\")","v":"■"},"向上",{"$f":"IF(VLOOKUP(概要版1!D484,一覧表!$E:$X,11,FALSE)=\"同程度\",\"■\",\"□\")","v":"□"},"同程度",{"$f":"IF(VLOOKUP(概要版1!D484,一覧表!$E:$X,11,FALSE)=\"低下\",\"■\",\"□\")","v":"□"},"低下",{"$f":"VLOOKUP(概要版1!D484,一覧表!$E:$X,17,FALSE)","v":"B"}]
[null,null,null,"安全性",{"$f":"IF(VLOOKUP(概要版1!D484,一覧表!$E:$X,12,FALSE)=\"向上\",\"■\",\"□\")","v":"■"},"向上",{"$f":"IF(VLOOKUP(概要版1!D484,一覧表!$E:$X,12,FALSE)=\"同程度\",\"■\",\"□\")","v":"□"},"同程度",{"$f":"IF(VLOOKUP(概要版1!D484,一覧表!$E:$X,12,FALSE)=\"低下\",\"■\",\"□\")","v":"□"},"低下",{"$f":"VLOOKUP(概要版1!D484,一覧表!$E:$X,18,FALSE)","v":"B"}]
[null,null,null,"施工性",{"$f":"IF(VLOOKUP(概要版1!D484,一覧表!$E:$X,13,FALSE)=\"向上\",\"■\",\"□\")","v":"■"},"向上",{"$f":"IF(VLOOKUP(概要版1!D484,一覧表!$E:$X,13,FALSE)=\"同程度\",\"■\",\"□\")","v":"□"},"同程度",{"$f":"IF(VLOOKUP(概要版1!D484,一覧表!$E:$X,13,FALSE)=\"低下\",\"■\",\"□\")","v":"□"},"低下",{"$f":"VLOOKUP(概要版1!D484,一覧表!$E:$X,19,FALSE)","v":"A"}]
[null,null,null,"環境",{"$f":"IF(VLOOKUP(概要版1!D484,一覧表!$E:$X,14,FALSE)=\"向上\",\"■\",\"□\")","v":"■"},"向上",{"$f":"IF(VLOOKUP(概要版1!D484,一覧表!$E:$X,14,FALSE)=\"同程度\",\"■\",\"□\")","v":"□"},"同程度",{"$f":"IF(VLOOKUP(概要版1!D484,一覧表!$E:$X,14,FALSE)=\"低下\",\"■\",\"□\")","v":"□"},"低下",{"$f":"VLOOKUP(概要版1!D484,一覧表!$E:$X,20,FALSE)","v":"B"}]
[]
[]
[]
[]
[null,{"$f":"D508","v":"CB-120011-VE"}]
[null,null,null,"CB-120011-VE",null,null,null,{"$f":"\"有用な技術の位置づけ：\"&VLOOKUP(D508,一覧表!$E:$G,3,FALSE)","v":"有用な技術の位置づけ：活用促進"},null,null,null,null,null,null,null,{"$f":"HYPERLINK(\"#一覧表!h\"&MATCH(D508,一覧表!E:E,0),\"一覧表に戻る\")","v":"一覧表に戻る"},{"$f":"Q484+1","v":22}]
[null,null,null,{"$f":"\"（工種 ： \"&VLOOKUP(D508,一覧表!$E:$AE,25,FALSE)&\"－\"&VLOOKUP(D508,一覧表!$E:$AE,26,FALSE)&\"－\"&IF(VLOOKUP(D508,一覧表!$E:$AE,27,FALSE)=\"\",\"　　　　　\",VLOOKUP(D508,一覧表!$E:$AE,27,FALSE))&\"）\"","v":"（工種 ： 橋梁上部工－鋼橋製作工－　　　　　）"}]
[]
[null,null,null,{"$f":"VLOOKUP(D508,一覧表!$E:$L,2,FALSE)","v":"鋼構造物溶接止端部の疲労強度向上工法"}]
[null,null,null,{"$f":"\"  副題 ： \"&VLOOKUP(D508,一覧表!$E:$AA,22,FALSE)","v":"  副題 ： 既設橋溶接部に対するニードルピーニング工法"}]
[null,null,null,null,null,null,null,null,null,null,null,null,{"$f":"\"開発者名 ： \"&VLOOKUP(D508,一覧表!$E:$AA,23,FALSE)","v":"開発者名 ： 東洋精鋼株式会社\n"}]
[]
[null,null,null,"概要、新規性及び期待される効果等",null,null,null,null,null,null,null,null,"図表等"]
[]
[null,null,null,{"$f":"VLOOKUP(D508,一覧表!$E:$L,7,FALSE)","v":"本技術は、鋼構造物の溶接継手部を強化する技術であり、従来は溶接継手部の止端部をグラインダー仕上げで対応していた。本技術の活用により、溶接継手部が強化され鋼構造物の耐久性を向上させると共に、工期の短縮、作業者の作業負荷軽減が期待できる技術である。"}]
[null,null,null,"活用の効果"]
[null,null,null,{"$f":"\"比較する従来技術 ： \"&VLOOKUP(D508,一覧表!$E:$L,8,FALSE)","v":"比較する従来技術 ： グラインダー仕上げ工法\n"}]
[null,null,null,"項目","申請情報",null,null,null,null,null,"評価結果\n（C：同程度）"]
[null,null,null,"経済性",{"$f":"IF(LEFT(VLOOKUP(概要版1!D508,一覧表!$E:$X,9,FALSE),2)=\"向上\",\"■\",\"□\")","v":"□"},{"$f":"IF(LEFT(VLOOKUP(概要版1!D508,一覧表!$E:$X,9,FALSE),2)=\"向上\",VLOOKUP(概要版1!D508,一覧表!$E:$X,9,FALSE),\"向上\")","v":"向上"},{"$f":"IF(VLOOKUP(概要版1!D508,一覧表!$E:$X,9,FALSE)=\"同程度\",\"■\",\"□\")","v":"□"},"同程度",{"$f":"IF(LEFT(VLOOKUP(概要版1!D508,一覧表!$E:$X,9,FALSE),2)=\"低下\",\"■\",\"□\")","v":"■"},{"$f":"IF(LEFT(VLOOKUP(概要版1!D508,一覧表!$E:$X,9,FALSE),2)=\"低下\",VLOOKUP(概要版1!D508,一覧表!$E:$X,9,FALSE),\"低下\")","v":"低下\n(-12%)\n"},{"$f":"VLOOKUP(概要版1!D508,一覧表!$E:$X,15,FALSE)","v":"C"}]
[null,null,null,"工程",{"$f":"IF(LEFT(VLOOKUP(概要版1!D508,一覧表!$E:$X,10,FALSE),2)=\"短縮\",\"■\",\"□\")","v":"■"},{"$f":"IF(LEFT(VLOOKUP(概要版1!D508,一覧表!$E:$X,10,FALSE),2)=\"短縮\",VLOOKUP(概要版1!D508,一覧表!$E:$X,10,FALSE),\"短縮\")","v":"短縮\n(84%)\n"},{"$f":"IF(VLOOKUP(概要版1!D508,一覧表!$E:$X,10,FALSE)=\"同程度\",\"■\",\"□\")","v":"□"},"同程度",{"$f":"IF(LEFT(VLOOKUP(概要版1!D508,一覧表!$E:$X,10,FALSE),2)=\"増加\",\"■\",\"□\")","v":"□"},{"$f":"IF(LEFT(VLOOKUP(概要版1!D508,一覧表!$E:$X,10,FALSE),2)=\"増加\",VLOOKUP(概要版1!D508,一覧表!$E:$X,10,FALSE),\"増加\")","v":"増加"},{"$f":"VLOOKUP(概要版1!D508,一覧表!$E:$X,16,FALSE)","v":"B"}]
[null,null,null,"品質",{"$f":"IF(VLOOKUP(概要版1!D508,一覧表!$E:$X,11,FALSE)=\"向上\",\"■\",\"□\")","v":"■"},"向上",{"$f":"IF(VLOOKUP(概要版1!D508,一覧表!$E:$X,11,FALSE)=\"同程度\",\"■\",\"□\")","v":"□"},"同程度",{"$f":"IF(VLOOKUP(概要版1!D508,一覧表!$E:$X,11,FALSE)=\"低下\",\"■\",\"□\")","v":"□"},"低下",{"$f":"VLOOKUP(概要版1!D508,一覧表!$E:$X,17,FALSE)","v":"B"}]
[null,null,null,"安全性",{"$f":"IF(VLOOKUP(概要版1!D508,一覧表!$E:$X,12,FALSE)=\"向上\",\"■\",\"□\")","v":"■"},"向上",{"$f":"IF(VLOOKUP(概要版1!D508,一覧表!$E:$X,12,FALSE)=\"同程度\",\"■\",\"□\")","v":"□"},"同程度",{"$f":"IF(VLOOKUP(概要版1!D508,一覧表!$E:$X,12,FALSE)=\"低下\",\"■\",\"□\")","v":"□"},"低下",{"$f":"VLOOKUP(概要版1!D508,一覧表!$E:$X,18,FALSE)","v":"B"}]
[null,null,null,"施工性",{"$f":"IF(VLOOKUP(概要版1!D508,一覧表!$E:$X,13,FALSE)=\"向上\",\"■\",\"□\")","v":"■"},"向上",{"$f":"IF(VLOOKUP(概要版1!D508,一覧表!$E:$X,13,FALSE)=\"同程度\",\"■\",\"□\")","v":"□"},"同程度",{"$f":"IF(VLOOKUP(概要版1!D508,一覧表!$E:$X,13,FALSE)=\"低下\",\"■\",\"□\")","v":"□"},"低下",{"$f":"VLOOKUP(概要版1!D508,一覧表!$E:$X,19,FALSE)","v":"B"}]
[null,null,null,"環境",{"$f":"IF(VLOOKUP(概要版1!D508,一覧表!$E:$X,14,FALSE)=\"向上\",\"■\",\"□\")","v":"■"},"向上",{"$f":"IF(VLOOKUP(概要版1!D508,一覧表!$E:$X,14,FALSE)=\"同程度\",\"■\",\"□\")","v":"□"},"同程度",{"$f":"IF(VLOOKUP(概要版1!D508,一覧表!$E:$X,14,FALSE)=\"低下\",\"■\",\"□\")","v":"□"},"低下",{"$f":"VLOOKUP(概要版1!D508,一覧表!$E:$X,20,FALSE)","v":"B"}]
[]
[]
[]
[]
[null,{"$f":"D532","v":"KT-160009-VR"}]
[null,null,null,"KT-160009-VR",null,null,null,{"$f":"\"有用な技術の位置づけ：\"&VLOOKUP(D532,一覧表!$E:$G,3,FALSE)","v":"有用な技術の位置づけ：活用促進"},null,null,null,null,null,null,null,{"$f":"HYPERLINK(\"#一覧表!h\"&MATCH(D532,一覧表!E:E,0),\"一覧表に戻る\")","v":"一覧表に戻る"},{"$f":"Q508+1","v":23}]
[null,null,null,{"$f":"\"（工種 ： \"&VLOOKUP(D532,一覧表!$E:$AE,25,FALSE)&\"－\"&VLOOKUP(D532,一覧表!$E:$AE,26,FALSE)&\"－\"&IF(VLOOKUP(D532,一覧表!$E:$AE,27,FALSE)=\"\",\"　　　　　\",VLOOKUP(D532,一覧表!$E:$AE,27,FALSE))&\"）\"","v":"（工種 ： 橋梁上部工－鋼橋製作工－　　　　　）"}]
[]
[null,null,null,{"$f":"VLOOKUP(D532,一覧表!$E:$L,2,FALSE)","v":"耐疲労性向上溶接材料および施工法 "}]
[null,null,null,{"$f":"\"  副題 ： \"&VLOOKUP(D532,一覧表!$E:$AA,22,FALSE)","v":"  副題 ： 低変態温度溶接材料(LTT溶接材料)を用いた付加溶接施工法による疲労特性改善"}]
[null,null,null,null,null,null,null,null,null,null,null,null,{"$f":"\"開発者名 ： \"&VLOOKUP(D532,一覧表!$E:$AA,23,FALSE)","v":"開発者名 ： 株式会社 神戸製鋼所"}]
[]
[null,null,null,"概要、新規性及び期待される効果等",null,null,null,null,null,null,null,null,"図表等"]
[]
[null,null,null,{"$f":"VLOOKUP(D532,一覧表!$E:$L,7,FALSE)","v":"本技術は溶接継手の疲労特性を向上させる技術で、従来はグラインダによる止端処理で対応していた。本技術の活用により構造物の耐久性が向上するとともに、処理速度向上による施工性および経済性の改善が図れます。"}]
[null,null,null,"活用の効果"]
[null,null,null,{"$f":"\"比較する従来技術 ： \"&VLOOKUP(D532,一覧表!$E:$L,8,FALSE)","v":"比較する従来技術 ： グラインダによる止端処理 "}]
[null,null,null,"項目","申請情報",null,null,null,null,null,"評価結果\n（C：同程度）"]
[null,null,null,"経済性",{"$f":"IF(LEFT(VLOOKUP(概要版1!D532,一覧表!$E:$X,9,FALSE),2)=\"向上\",\"■\",\"□\")","v":"■"},{"$f":"IF(LEFT(VLOOKUP(概要版1!D532,一覧表!$E:$X,9,FALSE),2)=\"向上\",VLOOKUP(概要版1!D532,一覧表!$E:$X,9,FALSE),\"向上\")","v":"向上\n(61%)\n"},{"$f":"IF(VLOOKUP(概要版1!D532,一覧表!$E:$X,9,FALSE)=\"同程度\",\"■\",\"□\")","v":"□"},"同程度",{"$f":"IF(LEFT(VLOOKUP(概要版1!D532,一覧表!$E:$X,9,FALSE),2)=\"低下\",\"■\",\"□\")","v":"□"},{"$f":"IF(LEFT(VLOOKUP(概要版1!D532,一覧表!$E:$X,9,FALSE),2)=\"低下\",VLOOKUP(概要版1!D532,一覧表!$E:$X,9,FALSE),\"低下\")","v":"低下"},{"$f":"VLOOKUP(概要版1!D532,一覧表!$E:$X,15,FALSE)","v":"B"}]
[null,null,null,"工程",{"$f":"IF(LEFT(VLOOKUP(概要版1!D532,一覧表!$E:$X,10,FALSE),2)=\"短縮\",\"■\",\"□\")","v":"■"},{"$f":"IF(LEFT(VLOOKUP(概要版1!D532,一覧表!$E:$X,10,FALSE),2)=\"短縮\",VLOOKUP(概要版1!D532,一覧表!$E:$X,10,FALSE),\"短縮\")","v":"短縮\n(78%)\n"},{"$f":"IF(VLOOKUP(概要版1!D532,一覧表!$E:$X,10,FALSE)=\"同程度\",\"■\",\"□\")","v":"□"},"同程度",{"$f":"IF(LEFT(VLOOKUP(概要版1!D532,一覧表!$E:$X,10,FALSE),2)=\"増加\",\"■\",\"□\")","v":"□"},{"$f":"IF(LEFT(VLOOKUP(概要版1!D532,一覧表!$E:$X,10,FALSE),2)=\"増加\",VLOOKUP(概要版1!D532,一覧表!$E:$X,10,FALSE),\"増加\")","v":"増加"},{"$f":"VLOOKUP(概要版1!D532,一覧表!$E:$X,16,FALSE)","v":"B"}]
[null,null,null,"品質",{"$f":"IF(VLOOKUP(概要版1!D532,一覧表!$E:$X,11,FALSE)=\"向上\",\"■\",\"□\")","v":"■"},"向上",{"$f":"IF(VLOOKUP(概要版1!D532,一覧表!$E:$X,11,FALSE)=\"同程度\",\"■\",\"□\")","v":"□"},"同程度",{"$f":"IF(VLOOKUP(概要版1!D532,一覧表!$E:$X,11,FALSE)=\"低下\",\"■\",\"□\")","v":"□"},"低下",{"$f":"VLOOKUP(概要版1!D532,一覧表!$E:$X,17,FALSE)","v":"B"}]
[null,null,null,"安全性",{"$f":"IF(VLOOKUP(概要版1!D532,一覧表!$E:$X,12,FALSE)=\"向上\",\"■\",\"□\")","v":"□"},"向上",{"$f":"IF(VLOOKUP(概要版1!D532,一覧表!$E:$X,12,FALSE)=\"同程度\",\"■\",\"□\")","v":"■"},"同程度",{"$f":"IF(VLOOKUP(概要版1!D532,一覧表!$E:$X,12,FALSE)=\"低下\",\"■\",\"□\")","v":"□"},"低下",{"$f":"VLOOKUP(概要版1!D532,一覧表!$E:$X,18,FALSE)","v":"C"}]
[null,null,null,"施工性",{"$f":"IF(VLOOKUP(概要版1!D532,一覧表!$E:$X,13,FALSE)=\"向上\",\"■\",\"□\")","v":"■"},"向上",{"$f":"IF(VLOOKUP(概要版1!D532,一覧表!$E:$X,13,FALSE)=\"同程度\",\"■\",\"□\")","v":"□"},"同程度",{"$f":"IF(VLOOKUP(概要版1!D532,一覧表!$E:$X,13,FALSE)=\"低下\",\"■\",\"□\")","v":"□"},"低下",{"$f":"VLOOKUP(概要版1!D532,一覧表!$E:$X,19,FALSE)","v":"B"}]
[null,null,null,"環境",{"$f":"IF(VLOOKUP(概要版1!D532,一覧表!$E:$X,14,FALSE)=\"向上\",\"■\",\"□\")","v":"■"},"向上",{"$f":"IF(VLOOKUP(概要版1!D532,一覧表!$E:$X,14,FALSE)=\"同程度\",\"■\",\"□\")","v":"□"},"同程度",{"$f":"IF(VLOOKUP(概要版1!D532,一覧表!$E:$X,14,FALSE)=\"低下\",\"■\",\"□\")","v":"□"},"低下",{"$f":"VLOOKUP(概要版1!D532,一覧表!$E:$X,20,FALSE)","v":"B"}]
[]
[]
[]
[]
[null,{"$f":"D556","v":"TH-140010-VR"}]
[null,null,null,"TH-140010-VR",null,null,null,{"$f":"\"有用な技術の位置づけ：\"&VLOOKUP(D556,一覧表!$E:$G,3,FALSE)","v":"有用な技術の位置づけ：活用促進"},null,null,null,null,null,null,null,{"$f":"HYPERLINK(\"#一覧表!h\"&MATCH(D556,一覧表!E:E,0),\"一覧表に戻る\")","v":"一覧表に戻る"},{"$f":"Q532+1","v":24}]
[null,null,null,{"$f":"\"（工種 ： \"&VLOOKUP(D556,一覧表!$E:$AE,25,FALSE)&\"－\"&VLOOKUP(D556,一覧表!$E:$AE,26,FALSE)&\"－\"&IF(VLOOKUP(D556,一覧表!$E:$AE,27,FALSE)=\"\",\"　　　　　\",VLOOKUP(D556,一覧表!$E:$AE,27,FALSE))&\"）\"","v":"（工種 ： 橋梁上部工－橋梁塗装工（新設）－　　　　　）"}]
[]
[null,null,null,{"$f":"VLOOKUP(D556,一覧表!$E:$L,2,FALSE)","v":"金属溶射の塗装工程省力化工法(SIC工法)"}]
[null,null,null,{"$f":"\"  副題 ： \"&VLOOKUP(D556,一覧表!$E:$AA,22,FALSE)","v":"  副題 ： 金属溶射の封孔処理で、完全封孔と着色の機能を持つ、多機能、省工程の重防食塗装。"}]
[null,null,null,null,null,null,null,null,null,null,null,null,{"$f":"\"開発者名 ： \"&VLOOKUP(D556,一覧表!$E:$AA,23,FALSE)","v":"開発者名 ： 株式会社中央コーポレーション、日本電通株式会社、株式会社永照"}]
[]
[null,null,null,"概要、新規性及び期待される効果等",null,null,null,null,null,null,null,null,"図表等"]
[]
[null,null,null,{"$f":"VLOOKUP(D556,一覧表!$E:$L,7,FALSE)","v":"本工法は金属溶射の塗装仕様であり、重防食塗装の技術である。封孔処理と塗装にSICシーラー(無溶剤1液型無機系封孔剤)を使用する。従来は有機溶剤系塗料で対応していた。本工法の活用により、工程の削減、耐久性の向上、環境負荷の低減が期待できる。 "}]
[null,null,null,"活用の効果"]
[null,null,null,{"$f":"\"比較する従来技術 ： \"&VLOOKUP(D556,一覧表!$E:$L,8,FALSE)","v":"比較する従来技術 ： 金属溶射を防食下地とした、有機溶剤系塗料による重防食塗装"}]
[null,null,null,"項目","申請情報",null,null,null,null,null,"評価結果\n（C：同程度）"]
[null,null,null,"経済性",{"$f":"IF(LEFT(VLOOKUP(概要版1!D556,一覧表!$E:$X,9,FALSE),2)=\"向上\",\"■\",\"□\")","v":"■"},{"$f":"IF(LEFT(VLOOKUP(概要版1!D556,一覧表!$E:$X,9,FALSE),2)=\"向上\",VLOOKUP(概要版1!D556,一覧表!$E:$X,9,FALSE),\"向上\")","v":"向上\n(0.3%)\n"},{"$f":"IF(VLOOKUP(概要版1!D556,一覧表!$E:$X,9,FALSE)=\"同程度\",\"■\",\"□\")","v":"□"},"同程度",{"$f":"IF(LEFT(VLOOKUP(概要版1!D556,一覧表!$E:$X,9,FALSE),2)=\"低下\",\"■\",\"□\")","v":"□"},{"$f":"IF(LEFT(VLOOKUP(概要版1!D556,一覧表!$E:$X,9,FALSE),2)=\"低下\",VLOOKUP(概要版1!D556,一覧表!$E:$X,9,FALSE),\"低下\")","v":"低下"},{"$f":"VLOOKUP(概要版1!D556,一覧表!$E:$X,15,FALSE)","v":"B"}]
[null,null,null,"工程",{"$f":"IF(LEFT(VLOOKUP(概要版1!D556,一覧表!$E:$X,10,FALSE),2)=\"短縮\",\"■\",\"□\")","v":"■"},{"$f":"IF(LEFT(VLOOKUP(概要版1!D556,一覧表!$E:$X,10,FALSE),2)=\"短縮\",VLOOKUP(概要版1!D556,一覧表!$E:$X,10,FALSE),\"短縮\")","v":"短縮\n(50%)\n"},{"$f":"IF(VLOOKUP(概要版1!D556,一覧表!$E:$X,10,FALSE)=\"同程度\",\"■\",\"□\")","v":"□"},"同程度",{"$f":"IF(LEFT(VLOOKUP(概要版1!D556,一覧表!$E:$X,10,FALSE),2)=\"増加\",\"■\",\"□\")","v":"□"},{"$f":"IF(LEFT(VLOOKUP(概要版1!D556,一覧表!$E:$X,10,FALSE),2)=\"増加\",VLOOKUP(概要版1!D556,一覧表!$E:$X,10,FALSE),\"増加\")","v":"増加"},{"$f":"VLOOKUP(概要版1!D556,一覧表!$E:$X,16,FALSE)","v":"B"}]
[null,null,null,"品質",{"$f":"IF(VLOOKUP(概要版1!D556,一覧表!$E:$X,11,FALSE)=\"向上\",\"■\",\"□\")","v":"■"},"向上",{"$f":"IF(VLOOKUP(概要版1!D556,一覧表!$E:$X,11,FALSE)=\"同程度\",\"■\",\"□\")","v":"□"},"同程度",{"$f":"IF(VLOOKUP(概要版1!D556,一覧表!$E:$X,11,FALSE)=\"低下\",\"■\",\"□\")","v":"□"},"低下",{"$f":"VLOOKUP(概要版1!D556,一覧表!$E:$X,17,FALSE)","v":"B"}]
[null,null,null,"安全性",{"$f":"IF(VLOOKUP(概要版1!D556,一覧表!$E:$X,12,FALSE)=\"向上\",\"■\",\"□\")","v":"□"},"向上",{"$f":"IF(VLOOKUP(概要版1!D556,一覧表!$E:$X,12,FALSE)=\"同程度\",\"■\",\"□\")","v":"■"},"同程度",{"$f":"IF(VLOOKUP(概要版1!D556,一覧表!$E:$X,12,FALSE)=\"低下\",\"■\",\"□\")","v":"□"},"低下",{"$f":"VLOOKUP(概要版1!D556,一覧表!$E:$X,18,FALSE)","v":"B"}]
[null,null,null,"施工性",{"$f":"IF(VLOOKUP(概要版1!D556,一覧表!$E:$X,13,FALSE)=\"向上\",\"■\",\"□\")","v":"■"},"向上",{"$f":"IF(VLOOKUP(概要版1!D556,一覧表!$E:$X,13,FALSE)=\"同程度\",\"■\",\"□\")","v":"□"},"同程度",{"$f":"IF(VLOOKUP(概要版1!D556,一覧表!$E:$X,13,FALSE)=\"低下\",\"■\",\"□\")","v":"□"},"低下",{"$f":"VLOOKUP(概要版1!D556,一覧表!$E:$X,19,FALSE)","v":"B"}]
[null,null,null,"環境",{"$f":"IF(VLOOKUP(概要版1!D556,一覧表!$E:$X,14,FALSE)=\"向上\",\"■\",\"□\")","v":"■"},"向上",{"$f":"IF(VLOOKUP(概要版1!D556,一覧表!$E:$X,14,FALSE)=\"同程度\",\"■\",\"□\")","v":"□"},"同程度",{"$f":"IF(VLOOKUP(概要版1!D556,一覧表!$E:$X,14,FALSE)=\"低下\",\"■\",\"□\")","v":"□"},"低下",{"$f":"VLOOKUP(概要版1!D556,一覧表!$E:$X,20,FALSE)","v":"B"}]
[]
[]
[]
[]
[null,{"$f":"D580","v":"KT-160058-VE"}]
[null,null,null,"KT-160058-VE",null,null,null,{"$f":"\"有用な技術の位置づけ：\"&VLOOKUP(D580,一覧表!$E:$G,3,FALSE)","v":"有用な技術の位置づけ：活用促進"},null,null,null,null,null,null,null,{"$f":"HYPERLINK(\"#一覧表!h\"&MATCH(D580,一覧表!E:E,0),\"一覧表に戻る\")","v":"一覧表に戻る"},{"$f":"Q556+1","v":25}]
[null,null,null,{"$f":"\"（工種 ： \"&VLOOKUP(D580,一覧表!$E:$AE,25,FALSE)&\"－\"&VLOOKUP(D580,一覧表!$E:$AE,26,FALSE)&\"－\"&IF(VLOOKUP(D580,一覧表!$E:$AE,27,FALSE)=\"\",\"　　　　　\",VLOOKUP(D580,一覧表!$E:$AE,27,FALSE))&\"）\"","v":"（工種 ： 橋梁上部工－鋼橋床版工－　　　　　）"}]
[]
[null,null,null,{"$f":"VLOOKUP(D580,一覧表!$E:$L,2,FALSE)","v":"KSボンド"}]
[null,null,null,{"$f":"\"  副題 ： \"&VLOOKUP(D580,一覧表!$E:$AA,22,FALSE)","v":"  副題 ： 土木用高耐久型エポキシ系接着剤"}]
[null,null,null,null,null,null,null,null,null,null,null,null,{"$f":"\"開発者名 ： \"&VLOOKUP(D580,一覧表!$E:$AA,23,FALSE)","v":"開発者名 ： 鹿島道路株式会社 "}]
[]
[null,null,null,"概要、新規性及び期待される効果等",null,null,null,null,null,null,null,null,"図表等"]
[]
[null,null,null,{"$f":"VLOOKUP(D580,一覧表!$E:$L,7,FALSE)","v":"本技術は、既設構造物とフレッシュコンクリート間に用いる土木用高耐久型エポキシ系接着剤で、従来はモルタル・コンクリート塗り継ぎ用エポキシ樹脂系接着剤で対応していた。本技術の活用により接着効果が確実に高くなるため、品質、安全性、経済性の向上が期待できる。"}]
[null,null,null,"活用の効果"]
[null,null,null,{"$f":"\"比較する従来技術 ： \"&VLOOKUP(D580,一覧表!$E:$L,8,FALSE)","v":"比較する従来技術 ： モルタル・コンクリート塗り継ぎ用エポキシ樹脂系接着剤 "}]
[null,null,null,"項目","申請情報",null,null,null,null,null,"評価結果\n（C：同程度）"]
[null,null,null,"経済性",{"$f":"IF(LEFT(VLOOKUP(概要版1!D580,一覧表!$E:$X,9,FALSE),2)=\"向上\",\"■\",\"□\")","v":"■"},{"$f":"IF(LEFT(VLOOKUP(概要版1!D580,一覧表!$E:$X,9,FALSE),2)=\"向上\",VLOOKUP(概要版1!D580,一覧表!$E:$X,9,FALSE),\"向上\")","v":"向上\n(2%)\n"},{"$f":"IF(VLOOKUP(概要版1!D580,一覧表!$E:$X,9,FALSE)=\"同程度\",\"■\",\"□\")","v":"□"},"同程度",{"$f":"IF(LEFT(VLOOKUP(概要版1!D580,一覧表!$E:$X,9,FALSE),2)=\"低下\",\"■\",\"□\")","v":"□"},{"$f":"IF(LEFT(VLOOKUP(概要版1!D580,一覧表!$E:$X,9,FALSE),2)=\"低下\",VLOOKUP(概要版1!D580,一覧表!$E:$X,9,FALSE),\"低下\")","v":"低下"},{"$f":"VLOOKUP(概要版1!D580,一覧表!$E:$X,15,FALSE)","v":"B"}]
[null,null,null,"工程",{"$f":"IF(LEFT(VLOOKUP(概要版1!D580,一覧表!$E:$X,10,FALSE),2)=\"短縮\",\"■\",\"□\")","v":"□"},{"$f":"IF(LEFT(VLOOKUP(概要版1!D580,一覧表!$E:$X,10,FALSE),2)=\"短縮\",VLOOKUP(概要版1!D580,一覧表!$E:$X,10,FALSE),\"短縮\")","v":"短縮"},{"$f":"IF(VLOOKUP(概要版1!D580,一覧表!$E:$X,10,FALSE)=\"同程度\",\"■\",\"□\")","v":"■"},"同程度",{"$f":"IF(LEFT(VLOOKUP(概要版1!D580,一覧表!$E:$X,10,FALSE),2)=\"増加\",\"■\",\"□\")","v":"□"},{"$f":"IF(LEFT(VLOOKUP(概要版1!D580,一覧表!$E:$X,10,FALSE),2)=\"増加\",VLOOKUP(概要版1!D580,一覧表!$E:$X,10,FALSE),\"増加\")","v":"増加"},{"$f":"VLOOKUP(概要版1!D580,一覧表!$E:$X,16,FALSE)","v":"C"}]
[null,null,null,"品質",{"$f":"IF(VLOOKUP(概要版1!D580,一覧表!$E:$X,11,FALSE)=\"向上\",\"■\",\"□\")","v":"■"},"向上",{"$f":"IF(VLOOKUP(概要版1!D580,一覧表!$E:$X,11,FALSE)=\"同程度\",\"■\",\"□\")","v":"□"},"同程度",{"$f":"IF(VLOOKUP(概要版1!D580,一覧表!$E:$X,11,FALSE)=\"低下\",\"■\",\"□\")","v":"□"},"低下",{"$f":"VLOOKUP(概要版1!D580,一覧表!$E:$X,17,FALSE)","v":"B"}]
[null,null,null,"安全性",{"$f":"IF(VLOOKUP(概要版1!D580,一覧表!$E:$X,12,FALSE)=\"向上\",\"■\",\"□\")","v":"■"},"向上",{"$f":"IF(VLOOKUP(概要版1!D580,一覧表!$E:$X,12,FALSE)=\"同程度\",\"■\",\"□\")","v":"□"},"同程度",{"$f":"IF(VLOOKUP(概要版1!D580,一覧表!$E:$X,12,FALSE)=\"低下\",\"■\",\"□\")","v":"□"},"低下",{"$f":"VLOOKUP(概要版1!D580,一覧表!$E:$X,18,FALSE)","v":"C"}]
[null,null,null,"施工性",{"$f":"IF(VLOOKUP(概要版1!D580,一覧表!$E:$X,13,FALSE)=\"向上\",\"■\",\"□\")","v":"□"},"向上",{"$f":"IF(VLOOKUP(概要版1!D580,一覧表!$E:$X,13,FALSE)=\"同程度\",\"■\",\"□\")","v":"■"},"同程度",{"$f":"IF(VLOOKUP(概要版1!D580,一覧表!$E:$X,13,FALSE)=\"低下\",\"■\",\"□\")","v":"□"},"低下",{"$f":"VLOOKUP(概要版1!D580,一覧表!$E:$X,19,FALSE)","v":"B"}]
[null,null,null,"環境",{"$f":"IF(VLOOKUP(概要版1!D580,一覧表!$E:$X,14,FALSE)=\"向上\",\"■\",\"□\")","v":"□"},"向上",{"$f":"IF(VLOOKUP(概要版1!D580,一覧表!$E:$X,14,FALSE)=\"同程度\",\"■\",\"□\")","v":"■"},"同程度",{"$f":"IF(VLOOKUP(概要版1!D580,一覧表!$E:$X,14,FALSE)=\"低下\",\"■\",\"□\")","v":"□"},"低下",{"$f":"VLOOKUP(概要版1!D580,一覧表!$E:$X,20,FALSE)","v":"C"}]
[]
[]
[]
[]
[null,{"$f":"D604","v":"QS-150030-VE"}]
[null,null,null,"QS-150030-VE",null,null,null,{"$f":"\"有用な技術の位置づけ：\"&VLOOKUP(D604,一覧表!$E:$G,3,FALSE)","v":"有用な技術の位置づけ：活用促進"},null,null,null,null,null,null,null,{"$f":"HYPERLINK(\"#一覧表!h\"&MATCH(D604,一覧表!E:E,0),\"一覧表に戻る\")","v":"一覧表に戻る"},{"$f":"Q580+1","v":26}]
[null,null,null,{"$f":"\"（工種 ： \"&VLOOKUP(D604,一覧表!$E:$AE,25,FALSE)&\"－\"&VLOOKUP(D604,一覧表!$E:$AE,26,FALSE)&\"－\"&IF(VLOOKUP(D604,一覧表!$E:$AE,27,FALSE)=\"\",\"　　　　　\",VLOOKUP(D604,一覧表!$E:$AE,27,FALSE))&\"）\"","v":"（工種 ： 橋梁上部工－ポストテンション桁製作工－緊張工）"}]
[]
[null,null,null,{"$f":"VLOOKUP(D604,一覧表!$E:$L,2,FALSE)","v":"Gキャップ(注入口付)"}]
[null,null,null,{"$f":"\"  副題 ： \"&VLOOKUP(D604,一覧表!$E:$AA,22,FALSE)","v":"  副題 ： プレグラウトPC鋼材定着具の注入口・排気口付き後注入式保護キャップ"}]
[null,null,null,null,null,null,null,null,null,null,null,null,{"$f":"\"開発者名 ： \"&VLOOKUP(D604,一覧表!$E:$AA,23,FALSE)","v":"開発者名 ： 株式会社片岡屋 "}]
[]
[null,null,null,"概要、新規性及び期待される効果等",null,null,null,null,null,null,null,null,"図表等"]
[]
[null,null,null,{"$f":"VLOOKUP(D604,一覧表!$E:$L,7,FALSE)","v":"プレグラウトPC鋼材定着具の保護キャップに注入口および排気口を設けたもので、従来は予め保護キャップ内に樹脂を満たした後、定着具に取り付けていた。本技術の活用により、樹脂の後注入と確実な空気溜りの排除が可能となるため、施工性および品質の向上が期待できる。"}]
[null,null,null,"活用の効果"]
[null,null,null,{"$f":"\"比較する従来技術 ： \"&VLOOKUP(D604,一覧表!$E:$L,8,FALSE)","v":"比較する従来技術 ： 一般的なグラウト保護キャップ "}]
[null,null,null,"項目","申請情報",null,null,null,null,null,"評価結果\n（C：同程度）"]
[null,null,null,"経済性",{"$f":"IF(LEFT(VLOOKUP(概要版1!D604,一覧表!$E:$X,9,FALSE),2)=\"向上\",\"■\",\"□\")","v":"■"},{"$f":"IF(LEFT(VLOOKUP(概要版1!D604,一覧表!$E:$X,9,FALSE),2)=\"向上\",VLOOKUP(概要版1!D604,一覧表!$E:$X,9,FALSE),\"向上\")","v":"向上\n(21%)\n"},{"$f":"IF(VLOOKUP(概要版1!D604,一覧表!$E:$X,9,FALSE)=\"同程度\",\"■\",\"□\")","v":"□"},"同程度",{"$f":"IF(LEFT(VLOOKUP(概要版1!D604,一覧表!$E:$X,9,FALSE),2)=\"低下\",\"■\",\"□\")","v":"□"},{"$f":"IF(LEFT(VLOOKUP(概要版1!D604,一覧表!$E:$X,9,FALSE),2)=\"低下\",VLOOKUP(概要版1!D604,一覧表!$E:$X,9,FALSE),\"低下\")","v":"低下"},{"$f":"VLOOKUP(概要版1!D604,一覧表!$E:$X,15,FALSE)","v":"B"}]
[null,null,null,"工程",{"$f":"IF(LEFT(VLOOKUP(概要版1!D604,一覧表!$E:$X,10,FALSE),2)=\"短縮\",\"■\",\"□\")","v":"■"},{"$f":"IF(LEFT(VLOOKUP(概要版1!D604,一覧表!$E:$X,10,FALSE),2)=\"短縮\",VLOOKUP(概要版1!D604,一覧表!$E:$X,10,FALSE),\"短縮\")","v":"短縮\n(80%)\n"},{"$f":"IF(VLOOKUP(概要版1!D604,一覧表!$E:$X,10,FALSE)=\"同程度\",\"■\",\"□\")","v":"□"},"同程度",{"$f":"IF(LEFT(VLOOKUP(概要版1!D604,一覧表!$E:$X,10,FALSE),2)=\"増加\",\"■\",\"□\")","v":"□"},{"$f":"IF(LEFT(VLOOKUP(概要版1!D604,一覧表!$E:$X,10,FALSE),2)=\"増加\",VLOOKUP(概要版1!D604,一覧表!$E:$X,10,FALSE),\"増加\")","v":"増加"},{"$f":"VLOOKUP(概要版1!D604,一覧表!$E:$X,16,FALSE)","v":"B"}]
[null,null,null,"品質",{"$f":"IF(VLOOKUP(概要版1!D604,一覧表!$E:$X,11,FALSE)=\"向上\",\"■\",\"□\")","v":"■"},"向上",{"$f":"IF(VLOOKUP(概要版1!D604,一覧表!$E:$X,11,FALSE)=\"同程度\",\"■\",\"□\")","v":"□"},"同程度",{"$f":"IF(VLOOKUP(概要版1!D604,一覧表!$E:$X,11,FALSE)=\"低下\",\"■\",\"□\")","v":"□"},"低下",{"$f":"VLOOKUP(概要版1!D604,一覧表!$E:$X,17,FALSE)","v":"B"}]
[null,null,null,"安全性",{"$f":"IF(VLOOKUP(概要版1!D604,一覧表!$E:$X,12,FALSE)=\"向上\",\"■\",\"□\")","v":"□"},"向上",{"$f":"IF(VLOOKUP(概要版1!D604,一覧表!$E:$X,12,FALSE)=\"同程度\",\"■\",\"□\")","v":"■"},"同程度",{"$f":"IF(VLOOKUP(概要版1!D604,一覧表!$E:$X,12,FALSE)=\"低下\",\"■\",\"□\")","v":"□"},"低下",{"$f":"VLOOKUP(概要版1!D604,一覧表!$E:$X,18,FALSE)","v":"C"}]
[null,null,null,"施工性",{"$f":"IF(VLOOKUP(概要版1!D604,一覧表!$E:$X,13,FALSE)=\"向上\",\"■\",\"□\")","v":"■"},"向上",{"$f":"IF(VLOOKUP(概要版1!D604,一覧表!$E:$X,13,FALSE)=\"同程度\",\"■\",\"□\")","v":"□"},"同程度",{"$f":"IF(VLOOKUP(概要版1!D604,一覧表!$E:$X,13,FALSE)=\"低下\",\"■\",\"□\")","v":"□"},"低下",{"$f":"VLOOKUP(概要版1!D604,一覧表!$E:$X,19,FALSE)","v":"B"}]
[null,null,null,"環境",{"$f":"IF(VLOOKUP(概要版1!D604,一覧表!$E:$X,14,FALSE)=\"向上\",\"■\",\"□\")","v":"□"},"向上",{"$f":"IF(VLOOKUP(概要版1!D604,一覧表!$E:$X,14,FALSE)=\"同程度\",\"■\",\"□\")","v":"■"},"同程度",{"$f":"IF(VLOOKUP(概要版1!D604,一覧表!$E:$X,14,FALSE)=\"低下\",\"■\",\"□\")","v":"□"},"低下",{"$f":"VLOOKUP(概要版1!D604,一覧表!$E:$X,20,FALSE)","v":"C"}]
[]
[]
[]
[]
[null,{"$f":"D628","v":"KT-120077-VE"}]
[null,null,null,"KT-120077-VE",null,null,null,{"$f":"\"有用な技術の位置づけ：\"&VLOOKUP(D628,一覧表!$E:$G,3,FALSE)","v":"有用な技術の位置づけ：活用促進"},null,null,null,null,null,null,null,{"$f":"HYPERLINK(\"#一覧表!h\"&MATCH(D628,一覧表!E:E,0),\"一覧表に戻る\")","v":"一覧表に戻る"},{"$f":"Q604+1","v":27}]
[null,null,null,{"$f":"\"（工種 ： \"&VLOOKUP(D628,一覧表!$E:$AE,25,FALSE)&\"－\"&VLOOKUP(D628,一覧表!$E:$AE,26,FALSE)&\"－\"&IF(VLOOKUP(D628,一覧表!$E:$AE,27,FALSE)=\"\",\"　　　　　\",VLOOKUP(D628,一覧表!$E:$AE,27,FALSE))&\"）\"","v":"（工種 ： 橋梁上部工－橋梁用伸縮継手装置設置工－　　　　　）"}]
[]
[null,null,null,{"$f":"VLOOKUP(D628,一覧表!$E:$L,2,FALSE)","v":"ブロフジョイントSW型"}]
[null,null,null,{"$f":"\"  副題 ： \"&VLOOKUP(D628,一覧表!$E:$AA,22,FALSE)","v":"  副題 ： 耐久性・走行性・止水性を向上させた伸縮継手装置"}]
[null,null,null,null,null,null,null,null,null,null,null,null,{"$f":"\"開発者名 ： \"&VLOOKUP(D628,一覧表!$E:$AA,23,FALSE)","v":"開発者名 ： 東京ファブリック工業株式会社"}]
[]
[null,null,null,"概要、新規性及び期待される効果等",null,null,null,null,null,null,null,null,"図表等"]
[]
[null,null,null,{"$f":"VLOOKUP(D628,一覧表!$E:$L,7,FALSE)","v":"本技術は遊間形状を波形にした橋梁用伸縮継手装置で、従来はゴム製伸縮継手装置で対応していた。本技術の活用により、タイヤとの接触が点接触となるため、車両通過時の衝撃音が減少し品質が向上する。"}]
[null,null,null,"活用の効果"]
[null,null,null,{"$f":"\"比較する従来技術 ： \"&VLOOKUP(D628,一覧表!$E:$L,8,FALSE)","v":"比較する従来技術 ： ゴム製伸縮継手装置"}]
[null,null,null,"項目","申請情報",null,null,null,null,null,"評価結果\n（C：同程度）",null,null,null,null,"　　　仕　様"]
[null,null,null,"経済性",{"$f":"IF(LEFT(VLOOKUP(概要版1!D628,一覧表!$E:$X,9,FALSE),2)=\"向上\",\"■\",\"□\")","v":"■"},{"$f":"IF(LEFT(VLOOKUP(概要版1!D628,一覧表!$E:$X,9,FALSE),2)=\"向上\",VLOOKUP(概要版1!D628,一覧表!$E:$X,9,FALSE),\"向上\")","v":"向上\n(20%)\n"},{"$f":"IF(VLOOKUP(概要版1!D628,一覧表!$E:$X,9,FALSE)=\"同程度\",\"■\",\"□\")","v":"□"},"同程度",{"$f":"IF(LEFT(VLOOKUP(概要版1!D628,一覧表!$E:$X,9,FALSE),2)=\"低下\",\"■\",\"□\")","v":"□"},{"$f":"IF(LEFT(VLOOKUP(概要版1!D628,一覧表!$E:$X,9,FALSE),2)=\"低下\",VLOOKUP(概要版1!D628,一覧表!$E:$X,9,FALSE),\"低下\")","v":"低下"},{"$f":"VLOOKUP(概要版1!D628,一覧表!$E:$X,15,FALSE)","v":"B"},null,null,null,"番号　","名称　","材質・仕様　"]
[null,null,null,"工程",{"$f":"IF(LEFT(VLOOKUP(概要版1!D628,一覧表!$E:$X,10,FALSE),2)=\"短縮\",\"■\",\"□\")","v":"□"},{"$f":"IF(LEFT(VLOOKUP(概要版1!D628,一覧表!$E:$X,10,FALSE),2)=\"短縮\",VLOOKUP(概要版1!D628,一覧表!$E:$X,10,FALSE),\"短縮\")","v":"短縮"},{"$f":"IF(VLOOKUP(概要版1!D628,一覧表!$E:$X,10,FALSE)=\"同程度\",\"■\",\"□\")","v":"■"},"同程度",{"$f":"IF(LEFT(VLOOKUP(概要版1!D628,一覧表!$E:$X,10,FALSE),2)=\"増加\",\"■\",\"□\")","v":"□"},{"$f":"IF(LEFT(VLOOKUP(概要版1!D628,一覧表!$E:$X,10,FALSE),2)=\"増加\",VLOOKUP(概要版1!D628,一覧表!$E:$X,10,FALSE),\"増加\")","v":"増加"},{"$f":"VLOOKUP(概要版1!D628,一覧表!$E:$X,16,FALSE)","v":"C"},null,null,null,"①　","保持金物　","SS400+SD345　"]
[null,null,null,"品質",{"$f":"IF(VLOOKUP(概要版1!D628,一覧表!$E:$X,11,FALSE)=\"向上\",\"■\",\"□\")","v":"■"},"向上",{"$f":"IF(VLOOKUP(概要版1!D628,一覧表!$E:$X,11,FALSE)=\"同程度\",\"■\",\"□\")","v":"□"},"同程度",{"$f":"IF(VLOOKUP(概要版1!D628,一覧表!$E:$X,11,FALSE)=\"低下\",\"■\",\"□\")","v":"□"},"低下",{"$f":"VLOOKUP(概要版1!D628,一覧表!$E:$X,17,FALSE)","v":"B"},null,null,null,"②　","一次止水構造(弾性シール材)　","STシールB　"]
[null,null,null,"安全性",{"$f":"IF(VLOOKUP(概要版1!D628,一覧表!$E:$X,12,FALSE)=\"向上\",\"■\",\"□\")","v":"□"},"向上",{"$f":"IF(VLOOKUP(概要版1!D628,一覧表!$E:$X,12,FALSE)=\"同程度\",\"■\",\"□\")","v":"■"},"同程度",{"$f":"IF(VLOOKUP(概要版1!D628,一覧表!$E:$X,12,FALSE)=\"低下\",\"■\",\"□\")","v":"□"},"低下",{"$f":"VLOOKUP(概要版1!D628,一覧表!$E:$X,18,FALSE)","v":"C"},null,null,null,"③　","一次止水構造(SWパッキン)　","再生ゴム　"]
[null,null,null,"施工性",{"$f":"IF(VLOOKUP(概要版1!D628,一覧表!$E:$X,13,FALSE)=\"向上\",\"■\",\"□\")","v":"□"},"向上",{"$f":"IF(VLOOKUP(概要版1!D628,一覧表!$E:$X,13,FALSE)=\"同程度\",\"■\",\"□\")","v":"■"},"同程度",{"$f":"IF(VLOOKUP(概要版1!D628,一覧表!$E:$X,13,FALSE)=\"低下\",\"■\",\"□\")","v":"□"},"低下",{"$f":"VLOOKUP(概要版1!D628,一覧表!$E:$X,19,FALSE)","v":"C"},null,null,null,"④　","二次止水構造(止水パッキン)　","合成ゴム　"]
[null,null,null,"環境",{"$f":"IF(VLOOKUP(概要版1!D628,一覧表!$E:$X,14,FALSE)=\"向上\",\"■\",\"□\")","v":"■"},"向上",{"$f":"IF(VLOOKUP(概要版1!D628,一覧表!$E:$X,14,FALSE)=\"同程度\",\"■\",\"□\")","v":"□"},"同程度",{"$f":"IF(VLOOKUP(概要版1!D628,一覧表!$E:$X,14,FALSE)=\"低下\",\"■\",\"□\")","v":"□"},"低下",{"$f":"VLOOKUP(概要版1!D628,一覧表!$E:$X,20,FALSE)","v":"B"}]
[]
[]
[]
[]
[null,{"$f":"D652","v":"TH-120010-VE"}]
[null,null,null,"TH-120010-VE",null,null,null,{"$f":"\"有用な技術の位置づけ：\"&VLOOKUP(D652,一覧表!$E:$G,3,FALSE)","v":"有用な技術の位置づけ：活用促進"},null,null,null,null,null,null,null,{"$f":"HYPERLINK(\"#一覧表!h\"&MATCH(D652,一覧表!E:E,0),\"一覧表に戻る\")","v":"一覧表に戻る"},{"$f":"Q628+1","v":28}]
[null,null,null,{"$f":"\"（工種 ： \"&VLOOKUP(D652,一覧表!$E:$AE,25,FALSE)&\"－\"&VLOOKUP(D652,一覧表!$E:$AE,26,FALSE)&\"－\"&IF(VLOOKUP(D652,一覧表!$E:$AE,27,FALSE)=\"\",\"　　　　　\",VLOOKUP(D652,一覧表!$E:$AE,27,FALSE))&\"）\"","v":"（工種 ： 橋梁上部工－その他－　　　　　）"}]
[]
[null,null,null,{"$f":"VLOOKUP(D652,一覧表!$E:$L,2,FALSE)","v":"パワーダンパー"}]
[null,null,null,{"$f":"\"  副題 ： \"&VLOOKUP(D652,一覧表!$E:$AA,22,FALSE)","v":"  副題 ： 橋梁に用いる粘性型制震ダンパー"}]
[null,null,null,null,null,null,null,null,null,null,null,null,{"$f":"\"開発者名 ： \"&VLOOKUP(D652,一覧表!$E:$AA,23,FALSE)","v":"開発者名 ： 株式会社横河ブリッジ、　オックスジャッキ株式会社"}]
[]
[null,null,null,"概要、新規性及び期待される効果等",null,null,null,null,null,null,null,null,"図表等"]
[]
[null,null,null,{"$f":"VLOOKUP(D652,一覧表!$E:$L,7,FALSE)","v":"本技術は地震力を低減させるシリンダ型粘性ダンパーです。本技術の活用により、橋脚基礎の補強を省略するとともに、橋脚の補強量を低減させることが可能となり、経済性が向上し、工程を短縮することができます。 "}]
[null,null,null,"活用の効果"]
[null,null,null,{"$f":"\"比較する従来技術 ： \"&VLOOKUP(D652,一覧表!$E:$L,8,FALSE)","v":"比較する従来技術 ： 橋脚基礎補強"}]
[null,null,null,"項目","申請情報",null,null,null,null,null,"評価結果\n（C：同程度）"]
[null,null,null,"経済性",{"$f":"IF(LEFT(VLOOKUP(概要版1!D652,一覧表!$E:$X,9,FALSE),2)=\"向上\",\"■\",\"□\")","v":"■"},{"$f":"IF(LEFT(VLOOKUP(概要版1!D652,一覧表!$E:$X,9,FALSE),2)=\"向上\",VLOOKUP(概要版1!D652,一覧表!$E:$X,9,FALSE),\"向上\")","v":"向上\n(46%)\n"},{"$f":"IF(VLOOKUP(概要版1!D652,一覧表!$E:$X,9,FALSE)=\"同程度\",\"■\",\"□\")","v":"□"},"同程度",{"$f":"IF(LEFT(VLOOKUP(概要版1!D652,一覧表!$E:$X,9,FALSE),2)=\"低下\",\"■\",\"□\")","v":"□"},{"$f":"IF(LEFT(VLOOKUP(概要版1!D652,一覧表!$E:$X,9,FALSE),2)=\"低下\",VLOOKUP(概要版1!D652,一覧表!$E:$X,9,FALSE),\"低下\")","v":"低下"},{"$f":"VLOOKUP(概要版1!D652,一覧表!$E:$X,15,FALSE)","v":"B"}]
[null,null,null,"工程",{"$f":"IF(LEFT(VLOOKUP(概要版1!D652,一覧表!$E:$X,10,FALSE),2)=\"短縮\",\"■\",\"□\")","v":"■"},{"$f":"IF(LEFT(VLOOKUP(概要版1!D652,一覧表!$E:$X,10,FALSE),2)=\"短縮\",VLOOKUP(概要版1!D652,一覧表!$E:$X,10,FALSE),\"短縮\")","v":"短縮\n(33%)\n"},{"$f":"IF(VLOOKUP(概要版1!D652,一覧表!$E:$X,10,FALSE)=\"同程度\",\"■\",\"□\")","v":"□"},"同程度",{"$f":"IF(LEFT(VLOOKUP(概要版1!D652,一覧表!$E:$X,10,FALSE),2)=\"増加\",\"■\",\"□\")","v":"□"},{"$f":"IF(LEFT(VLOOKUP(概要版1!D652,一覧表!$E:$X,10,FALSE),2)=\"増加\",VLOOKUP(概要版1!D652,一覧表!$E:$X,10,FALSE),\"増加\")","v":"増加"},{"$f":"VLOOKUP(概要版1!D652,一覧表!$E:$X,16,FALSE)","v":"B"}]
[null,null,null,"品質",{"$f":"IF(VLOOKUP(概要版1!D652,一覧表!$E:$X,11,FALSE)=\"向上\",\"■\",\"□\")","v":"□"},"向上",{"$f":"IF(VLOOKUP(概要版1!D652,一覧表!$E:$X,11,FALSE)=\"同程度\",\"■\",\"□\")","v":"■"},"同程度",{"$f":"IF(VLOOKUP(概要版1!D652,一覧表!$E:$X,11,FALSE)=\"低下\",\"■\",\"□\")","v":"□"},"低下",{"$f":"VLOOKUP(概要版1!D652,一覧表!$E:$X,17,FALSE)","v":"B"}]
[null,null,null,"安全性",{"$f":"IF(VLOOKUP(概要版1!D652,一覧表!$E:$X,12,FALSE)=\"向上\",\"■\",\"□\")","v":"□"},"向上",{"$f":"IF(VLOOKUP(概要版1!D652,一覧表!$E:$X,12,FALSE)=\"同程度\",\"■\",\"□\")","v":"■"},"同程度",{"$f":"IF(VLOOKUP(概要版1!D652,一覧表!$E:$X,12,FALSE)=\"低下\",\"■\",\"□\")","v":"□"},"低下",{"$f":"VLOOKUP(概要版1!D652,一覧表!$E:$X,18,FALSE)","v":"C"}]
[null,null,null,"施工性",{"$f":"IF(VLOOKUP(概要版1!D652,一覧表!$E:$X,13,FALSE)=\"向上\",\"■\",\"□\")","v":"■"},"向上",{"$f":"IF(VLOOKUP(概要版1!D652,一覧表!$E:$X,13,FALSE)=\"同程度\",\"■\",\"□\")","v":"□"},"同程度",{"$f":"IF(VLOOKUP(概要版1!D652,一覧表!$E:$X,13,FALSE)=\"低下\",\"■\",\"□\")","v":"□"},"低下",{"$f":"VLOOKUP(概要版1!D652,一覧表!$E:$X,19,FALSE)","v":"B"}]
[null,null,null,"環境",{"$f":"IF(VLOOKUP(概要版1!D652,一覧表!$E:$X,14,FALSE)=\"向上\",\"■\",\"□\")","v":"□"},"向上",{"$f":"IF(VLOOKUP(概要版1!D652,一覧表!$E:$X,14,FALSE)=\"同程度\",\"■\",\"□\")","v":"■"},"同程度",{"$f":"IF(VLOOKUP(概要版1!D652,一覧表!$E:$X,14,FALSE)=\"低下\",\"■\",\"□\")","v":"□"},"低下",{"$f":"VLOOKUP(概要版1!D652,一覧表!$E:$X,20,FALSE)","v":"C"}]
[]
[]
[]
[]
[null,{"$f":"D676","v":"CB-120033-VE"}]
[null,null,null,"CB-120033-VE",null,null,null,{"$f":"\"有用な技術の位置づけ：\"&VLOOKUP(D676,一覧表!$E:$G,3,FALSE)","v":"有用な技術の位置づけ：活用促進"},null,null,null,null,null,null,null,{"$f":"HYPERLINK(\"#一覧表!h\"&MATCH(D676,一覧表!E:E,0),\"一覧表に戻る\")","v":"一覧表に戻る"},{"$f":"Q652+1","v":29}]
[null,null,null,{"$f":"\"（工種 ： \"&VLOOKUP(D676,一覧表!$E:$AE,25,FALSE)&\"－\"&VLOOKUP(D676,一覧表!$E:$AE,26,FALSE)&\"－\"&IF(VLOOKUP(D676,一覧表!$E:$AE,27,FALSE)=\"\",\"　　　　　\",VLOOKUP(D676,一覧表!$E:$AE,27,FALSE))&\"）\"","v":"（工種 ： 橋梁上部工－その他－　　　　　）"}]
[]
[null,null,null,{"$f":"VLOOKUP(D676,一覧表!$E:$L,2,FALSE)","v":"FRP検査路"}]
[null,null,null,{"$f":"\"  副題 ： \"&VLOOKUP(D676,一覧表!$E:$AA,22,FALSE)","v":"  副題 ： 繊維強化プラスティックを用いた、軽量・耐食性に優れた検査路"}]
[null,null,null,null,null,null,null,null,null,null,null,null,{"$f":"\"開発者名 ： \"&VLOOKUP(D676,一覧表!$E:$AA,23,FALSE)","v":"開発者名 ： 宮地エンジニアリング株式会社、AGCマテックス株式会社"}]
[]
[null,null,null,"概要、新規性及び期待される効果等",null,null,null,null,null,null,null,null,"図表等"]
[]
[null,null,null,{"$f":"VLOOKUP(D676,一覧表!$E:$L,7,FALSE)","v":"FRP検査路は、腐食により保全のための点検ができない問題を解消し、点検中の転落などの不幸な事故を防止する、安心・安全で長持ちする技術です。 "}]
[null,null,null,"活用の効果"]
[null,null,null,{"$f":"\"比較する従来技術 ： \"&VLOOKUP(D676,一覧表!$E:$L,8,FALSE)","v":"比較する従来技術 ： 塩害地域の鋼製検査路(溶融亜鉛メッキ)"}]
[null,null,null,"項目","申請情報",null,null,null,null,null,"評価結果\n（C：同程度）"]
[null,null,null,"経済性",{"$f":"IF(LEFT(VLOOKUP(概要版1!D676,一覧表!$E:$X,9,FALSE),2)=\"向上\",\"■\",\"□\")","v":"■"},{"$f":"IF(LEFT(VLOOKUP(概要版1!D676,一覧表!$E:$X,9,FALSE),2)=\"向上\",VLOOKUP(概要版1!D676,一覧表!$E:$X,9,FALSE),\"向上\")","v":"向上\n(53%)\n"},{"$f":"IF(VLOOKUP(概要版1!D676,一覧表!$E:$X,9,FALSE)=\"同程度\",\"■\",\"□\")","v":"□"},"同程度",{"$f":"IF(LEFT(VLOOKUP(概要版1!D676,一覧表!$E:$X,9,FALSE),2)=\"低下\",\"■\",\"□\")","v":"□"},{"$f":"IF(LEFT(VLOOKUP(概要版1!D676,一覧表!$E:$X,9,FALSE),2)=\"低下\",VLOOKUP(概要版1!D676,一覧表!$E:$X,9,FALSE),\"低下\")","v":"低下"},{"$f":"VLOOKUP(概要版1!D676,一覧表!$E:$X,15,FALSE)","v":"B"}]
[null,null,null,"工程",{"$f":"IF(LEFT(VLOOKUP(概要版1!D676,一覧表!$E:$X,10,FALSE),2)=\"短縮\",\"■\",\"□\")","v":"■"},{"$f":"IF(LEFT(VLOOKUP(概要版1!D676,一覧表!$E:$X,10,FALSE),2)=\"短縮\",VLOOKUP(概要版1!D676,一覧表!$E:$X,10,FALSE),\"短縮\")","v":"短縮\n(40%)\n"},{"$f":"IF(VLOOKUP(概要版1!D676,一覧表!$E:$X,10,FALSE)=\"同程度\",\"■\",\"□\")","v":"□"},"同程度",{"$f":"IF(LEFT(VLOOKUP(概要版1!D676,一覧表!$E:$X,10,FALSE),2)=\"増加\",\"■\",\"□\")","v":"□"},{"$f":"IF(LEFT(VLOOKUP(概要版1!D676,一覧表!$E:$X,10,FALSE),2)=\"増加\",VLOOKUP(概要版1!D676,一覧表!$E:$X,10,FALSE),\"増加\")","v":"増加"},{"$f":"VLOOKUP(概要版1!D676,一覧表!$E:$X,16,FALSE)","v":"B"}]
[null,null,null,"品質",{"$f":"IF(VLOOKUP(概要版1!D676,一覧表!$E:$X,11,FALSE)=\"向上\",\"■\",\"□\")","v":"□"},"向上",{"$f":"IF(VLOOKUP(概要版1!D676,一覧表!$E:$X,11,FALSE)=\"同程度\",\"■\",\"□\")","v":"■"},"同程度",{"$f":"IF(VLOOKUP(概要版1!D676,一覧表!$E:$X,11,FALSE)=\"低下\",\"■\",\"□\")","v":"□"},"低下",{"$f":"VLOOKUP(概要版1!D676,一覧表!$E:$X,17,FALSE)","v":"B"}]
[null,null,null,"安全性",{"$f":"IF(VLOOKUP(概要版1!D676,一覧表!$E:$X,12,FALSE)=\"向上\",\"■\",\"□\")","v":"■"},"向上",{"$f":"IF(VLOOKUP(概要版1!D676,一覧表!$E:$X,12,FALSE)=\"同程度\",\"■\",\"□\")","v":"□"},"同程度",{"$f":"IF(VLOOKUP(概要版1!D676,一覧表!$E:$X,12,FALSE)=\"低下\",\"■\",\"□\")","v":"□"},"低下",{"$f":"VLOOKUP(概要版1!D676,一覧表!$E:$X,18,FALSE)","v":"B"}]
[null,null,null,"施工性",{"$f":"IF(VLOOKUP(概要版1!D676,一覧表!$E:$X,13,FALSE)=\"向上\",\"■\",\"□\")","v":"■"},"向上",{"$f":"IF(VLOOKUP(概要版1!D676,一覧表!$E:$X,13,FALSE)=\"同程度\",\"■\",\"□\")","v":"□"},"同程度",{"$f":"IF(VLOOKUP(概要版1!D676,一覧表!$E:$X,13,FALSE)=\"低下\",\"■\",\"□\")","v":"□"},"低下",{"$f":"VLOOKUP(概要版1!D676,一覧表!$E:$X,19,FALSE)","v":"B"}]
[null,null,null,"環境",{"$f":"IF(VLOOKUP(概要版1!D676,一覧表!$E:$X,14,FALSE)=\"向上\",\"■\",\"□\")","v":"□"},"向上",{"$f":"IF(VLOOKUP(概要版1!D676,一覧表!$E:$X,14,FALSE)=\"同程度\",\"■\",\"□\")","v":"■"},"同程度",{"$f":"IF(VLOOKUP(概要版1!D676,一覧表!$E:$X,14,FALSE)=\"低下\",\"■\",\"□\")","v":"□"},"低下",{"$f":"VLOOKUP(概要版1!D676,一覧表!$E:$X,20,FALSE)","v":"C"}]
[]
[]
[]
[]
[null,{"$f":"D700","v":"KT-130026-VE"}]
[null,null,null,"KT-130026-VE",null,null,null,{"$f":"\"有用な技術の位置づけ：\"&VLOOKUP(D700,一覧表!$E:$G,3,FALSE)","v":"有用な技術の位置づけ：活用促進"},null,null,null,null,null,null,null,{"$f":"HYPERLINK(\"#一覧表!h\"&MATCH(D700,一覧表!E:E,0),\"一覧表に戻る\")","v":"一覧表に戻る"},{"$f":"Q676+1","v":30}]
[null,null,null,{"$f":"\"（工種 ： \"&VLOOKUP(D700,一覧表!$E:$AE,25,FALSE)&\"－\"&VLOOKUP(D700,一覧表!$E:$AE,26,FALSE)&\"－\"&IF(VLOOKUP(D700,一覧表!$E:$AE,27,FALSE)=\"\",\"　　　　　\",VLOOKUP(D700,一覧表!$E:$AE,27,FALSE))&\"）\"","v":"（工種 ： 調査試験－測量－その他）"}]
[]
[null,null,null,{"$f":"VLOOKUP(D700,一覧表!$E:$L,2,FALSE)","v":"快速深浅測量システム"}]
[null,null,null,{"$f":"\"  副題 ： \"&VLOOKUP(D700,一覧表!$E:$AA,22,FALSE)","v":"  副題 ： GPS電波を受信できる場所はもちろんのこと、GPS電波を受信できない場所でも水底の形状を高精度に測量する深浅測量"}]
[null,null,null,null,null,null,null,null,null,null,null,null,{"$f":"\"開発者名 ： \"&VLOOKUP(D700,一覧表!$E:$AA,23,FALSE)","v":"開発者名 ： 株式会社CSS技術開発"}]
[]
[null,null,null,"概要、新規性及び期待される効果等",null,null,null,null,null,null,null,null,"図表等"]
[]
[null,null,null,{"$f":"VLOOKUP(D700,一覧表!$E:$L,7,FALSE)","v":"本技術は、2台のGPS受信機等と音響測深機を用いた深浅測量システムで、従来は、トータルステーションと音響測深機を用いた深浅測量で対応していた。本技術の活用により、測点毎のトータルステーションの操作が不要となり、工期短縮が図れる。 "}]
[null,null,null,"活用の効果"]
[null,null,null,{"$f":"\"比較する従来技術 ： \"&VLOOKUP(D700,一覧表!$E:$L,8,FALSE)","v":"比較する従来技術 ： トータルステーションと音響測深機を用いた深浅測量"}]
[null,null,null,"項目","申請情報",null,null,null,null,null,"評価結果\n（C：同程度）"]
[null,null,null,"経済性",{"$f":"IF(LEFT(VLOOKUP(概要版1!D700,一覧表!$E:$X,9,FALSE),2)=\"向上\",\"■\",\"□\")","v":"■"},{"$f":"IF(LEFT(VLOOKUP(概要版1!D700,一覧表!$E:$X,9,FALSE),2)=\"向上\",VLOOKUP(概要版1!D700,一覧表!$E:$X,9,FALSE),\"向上\")","v":"向上\n(43%)\n"},{"$f":"IF(VLOOKUP(概要版1!D700,一覧表!$E:$X,9,FALSE)=\"同程度\",\"■\",\"□\")","v":"□"},"同程度",{"$f":"IF(LEFT(VLOOKUP(概要版1!D700,一覧表!$E:$X,9,FALSE),2)=\"低下\",\"■\",\"□\")","v":"□"},{"$f":"IF(LEFT(VLOOKUP(概要版1!D700,一覧表!$E:$X,9,FALSE),2)=\"低下\",VLOOKUP(概要版1!D700,一覧表!$E:$X,9,FALSE),\"低下\")","v":"低下"},{"$f":"VLOOKUP(概要版1!D700,一覧表!$E:$X,15,FALSE)","v":"B"}]
[null,null,null,"工程",{"$f":"IF(LEFT(VLOOKUP(概要版1!D700,一覧表!$E:$X,10,FALSE),2)=\"短縮\",\"■\",\"□\")","v":"■"},{"$f":"IF(LEFT(VLOOKUP(概要版1!D700,一覧表!$E:$X,10,FALSE),2)=\"短縮\",VLOOKUP(概要版1!D700,一覧表!$E:$X,10,FALSE),\"短縮\")","v":"短縮\n(33%)\n"},{"$f":"IF(VLOOKUP(概要版1!D700,一覧表!$E:$X,10,FALSE)=\"同程度\",\"■\",\"□\")","v":"□"},"同程度",{"$f":"IF(LEFT(VLOOKUP(概要版1!D700,一覧表!$E:$X,10,FALSE),2)=\"増加\",\"■\",\"□\")","v":"□"},{"$f":"IF(LEFT(VLOOKUP(概要版1!D700,一覧表!$E:$X,10,FALSE),2)=\"増加\",VLOOKUP(概要版1!D700,一覧表!$E:$X,10,FALSE),\"増加\")","v":"増加"},{"$f":"VLOOKUP(概要版1!D700,一覧表!$E:$X,16,FALSE)","v":"B"}]
[null,null,null,"品質",{"$f":"IF(VLOOKUP(概要版1!D700,一覧表!$E:$X,11,FALSE)=\"向上\",\"■\",\"□\")","v":"□"},"向上",{"$f":"IF(VLOOKUP(概要版1!D700,一覧表!$E:$X,11,FALSE)=\"同程度\",\"■\",\"□\")","v":"■"},"同程度",{"$f":"IF(VLOOKUP(概要版1!D700,一覧表!$E:$X,11,FALSE)=\"低下\",\"■\",\"□\")","v":"□"},"低下",{"$f":"VLOOKUP(概要版1!D700,一覧表!$E:$X,17,FALSE)","v":"B"}]
[null,null,null,"安全性",{"$f":"IF(VLOOKUP(概要版1!D700,一覧表!$E:$X,12,FALSE)=\"向上\",\"■\",\"□\")","v":"□"},"向上",{"$f":"IF(VLOOKUP(概要版1!D700,一覧表!$E:$X,12,FALSE)=\"同程度\",\"■\",\"□\")","v":"■"},"同程度",{"$f":"IF(VLOOKUP(概要版1!D700,一覧表!$E:$X,12,FALSE)=\"低下\",\"■\",\"□\")","v":"□"},"低下",{"$f":"VLOOKUP(概要版1!D700,一覧表!$E:$X,18,FALSE)","v":"－"}]
[null,null,null,"施工性",{"$f":"IF(VLOOKUP(概要版1!D700,一覧表!$E:$X,13,FALSE)=\"向上\",\"■\",\"□\")","v":"■"},"向上",{"$f":"IF(VLOOKUP(概要版1!D700,一覧表!$E:$X,13,FALSE)=\"同程度\",\"■\",\"□\")","v":"□"},"同程度",{"$f":"IF(VLOOKUP(概要版1!D700,一覧表!$E:$X,13,FALSE)=\"低下\",\"■\",\"□\")","v":"□"},"低下",{"$f":"VLOOKUP(概要版1!D700,一覧表!$E:$X,19,FALSE)","v":"B"}]
[null,null,null,"環境",{"$f":"IF(VLOOKUP(概要版1!D700,一覧表!$E:$X,14,FALSE)=\"向上\",\"■\",\"□\")","v":"□"},"向上",{"$f":"IF(VLOOKUP(概要版1!D700,一覧表!$E:$X,14,FALSE)=\"同程度\",\"■\",\"□\")","v":"■"},"同程度",{"$f":"IF(VLOOKUP(概要版1!D700,一覧表!$E:$X,14,FALSE)=\"低下\",\"■\",\"□\")","v":"□"},"低下",{"$f":"VLOOKUP(概要版1!D700,一覧表!$E:$X,20,FALSE)","v":"－"},null,"快速深浅測量の概略図"]
[]
[]
[]
[]
[null,{"$f":"D724","v":"QS-160031-VE"}]
[null,null,null,"QS-160031-VE",null,null,null,{"$f":"\"有用な技術の位置づけ：\"&VLOOKUP(D724,一覧表!$E:$G,3,FALSE)","v":"有用な技術の位置づけ：活用促進"},null,null,null,null,null,null,null,{"$f":"HYPERLINK(\"#一覧表!h\"&MATCH(D724,一覧表!E:E,0),\"一覧表に戻る\")","v":"一覧表に戻る"},{"$f":"Q700+1","v":31}]
[null,null,null,{"$f":"\"（工種 ： \"&VLOOKUP(D724,一覧表!$E:$AE,25,FALSE)&\"－\"&VLOOKUP(D724,一覧表!$E:$AE,26,FALSE)&\"－\"&IF(VLOOKUP(D724,一覧表!$E:$AE,27,FALSE)=\"\",\"　　　　　\",VLOOKUP(D724,一覧表!$E:$AE,27,FALSE))&\"）\"","v":"（工種 ： 調査試験－測量－その他）"}]
[]
[null,null,null,{"$f":"VLOOKUP(D724,一覧表!$E:$L,2,FALSE)","v":"無線遠隔操縦等の小型船舶による高精度深浅測量システム"}]
[null,null,null,{"$f":"\"  副題 ： \"&VLOOKUP(D724,一覧表!$E:$AA,22,FALSE)","v":"  副題 ： 動揺センサー搭載によるリアルタイム補正"}]
[null,null,null,null,null,null,null,null,null,null,null,null,{"$f":"\"開発者名 ： \"&VLOOKUP(D724,一覧表!$E:$AA,23,FALSE)","v":"開発者名 ： 株式会社国際海洋開発、国立大学法人九州工業大学"}]
[]
[null,null,null,"概要、新規性及び期待される効果等",null,null,null,null,null,null,null,null,"図表等"]
[]
[null,null,null,{"$f":"VLOOKUP(D724,一覧表!$E:$L,7,FALSE)","v":"無線遠隔操縦等による小型船舶は小さな波の影響を受け動揺しやすい。従って、測深機のみを搭載しても、水深精度を著しく低下させる。開発システムは無人小型船舶に動揺センサを搭載し、リアルタイムに補正する音響測深システムである。"}]
[null,null,null,"活用の効果"]
[null,null,null,{"$f":"\"比較する従来技術 ： \"&VLOOKUP(D724,一覧表!$E:$L,8,FALSE)","v":"比較する従来技術 ： 測量船による深浅測量"}]
[null,null,null,"項目","申請情報",null,null,null,null,null,"評価結果\n（C：同程度）"]
[null,null,null,"経済性",{"$f":"IF(LEFT(VLOOKUP(概要版1!D724,一覧表!$E:$X,9,FALSE),2)=\"向上\",\"■\",\"□\")","v":"■"},{"$f":"IF(LEFT(VLOOKUP(概要版1!D724,一覧表!$E:$X,9,FALSE),2)=\"向上\",VLOOKUP(概要版1!D724,一覧表!$E:$X,9,FALSE),\"向上\")","v":"向上\n(9%)\n"},{"$f":"IF(VLOOKUP(概要版1!D724,一覧表!$E:$X,9,FALSE)=\"同程度\",\"■\",\"□\")","v":"□"},"同程度",{"$f":"IF(LEFT(VLOOKUP(概要版1!D724,一覧表!$E:$X,9,FALSE),2)=\"低下\",\"■\",\"□\")","v":"□"},{"$f":"IF(LEFT(VLOOKUP(概要版1!D724,一覧表!$E:$X,9,FALSE),2)=\"低下\",VLOOKUP(概要版1!D724,一覧表!$E:$X,9,FALSE),\"低下\")","v":"低下"},{"$f":"VLOOKUP(概要版1!D724,一覧表!$E:$X,15,FALSE)","v":"B"}]
[null,null,null,"工程",{"$f":"IF(LEFT(VLOOKUP(概要版1!D724,一覧表!$E:$X,10,FALSE),2)=\"短縮\",\"■\",\"□\")","v":"■"},{"$f":"IF(LEFT(VLOOKUP(概要版1!D724,一覧表!$E:$X,10,FALSE),2)=\"短縮\",VLOOKUP(概要版1!D724,一覧表!$E:$X,10,FALSE),\"短縮\")","v":"短縮\n(18%)\n"},{"$f":"IF(VLOOKUP(概要版1!D724,一覧表!$E:$X,10,FALSE)=\"同程度\",\"■\",\"□\")","v":"□"},"同程度",{"$f":"IF(LEFT(VLOOKUP(概要版1!D724,一覧表!$E:$X,10,FALSE),2)=\"増加\",\"■\",\"□\")","v":"□"},{"$f":"IF(LEFT(VLOOKUP(概要版1!D724,一覧表!$E:$X,10,FALSE),2)=\"増加\",VLOOKUP(概要版1!D724,一覧表!$E:$X,10,FALSE),\"増加\")","v":"増加"},{"$f":"VLOOKUP(概要版1!D724,一覧表!$E:$X,16,FALSE)","v":"B"}]
[null,null,null,"品質",{"$f":"IF(VLOOKUP(概要版1!D724,一覧表!$E:$X,11,FALSE)=\"向上\",\"■\",\"□\")","v":"■"},"向上",{"$f":"IF(VLOOKUP(概要版1!D724,一覧表!$E:$X,11,FALSE)=\"同程度\",\"■\",\"□\")","v":"□"},"同程度",{"$f":"IF(VLOOKUP(概要版1!D724,一覧表!$E:$X,11,FALSE)=\"低下\",\"■\",\"□\")","v":"□"},"低下",{"$f":"VLOOKUP(概要版1!D724,一覧表!$E:$X,17,FALSE)","v":"B"}]
[null,null,null,"安全性",{"$f":"IF(VLOOKUP(概要版1!D724,一覧表!$E:$X,12,FALSE)=\"向上\",\"■\",\"□\")","v":"■"},"向上",{"$f":"IF(VLOOKUP(概要版1!D724,一覧表!$E:$X,12,FALSE)=\"同程度\",\"■\",\"□\")","v":"□"},"同程度",{"$f":"IF(VLOOKUP(概要版1!D724,一覧表!$E:$X,12,FALSE)=\"低下\",\"■\",\"□\")","v":"□"},"低下",{"$f":"VLOOKUP(概要版1!D724,一覧表!$E:$X,18,FALSE)","v":"B"}]
[null,null,null,"施工性",{"$f":"IF(VLOOKUP(概要版1!D724,一覧表!$E:$X,13,FALSE)=\"向上\",\"■\",\"□\")","v":"■"},"向上",{"$f":"IF(VLOOKUP(概要版1!D724,一覧表!$E:$X,13,FALSE)=\"同程度\",\"■\",\"□\")","v":"□"},"同程度",{"$f":"IF(VLOOKUP(概要版1!D724,一覧表!$E:$X,13,FALSE)=\"低下\",\"■\",\"□\")","v":"□"},"低下",{"$f":"VLOOKUP(概要版1!D724,一覧表!$E:$X,19,FALSE)","v":"B"}]
[null,null,null,"環境",{"$f":"IF(VLOOKUP(概要版1!D724,一覧表!$E:$X,14,FALSE)=\"向上\",\"■\",\"□\")","v":"■"},"向上",{"$f":"IF(VLOOKUP(概要版1!D724,一覧表!$E:$X,14,FALSE)=\"同程度\",\"■\",\"□\")","v":"□"},"同程度",{"$f":"IF(VLOOKUP(概要版1!D724,一覧表!$E:$X,14,FALSE)=\"低下\",\"■\",\"□\")","v":"□"},"低下",{"$f":"VLOOKUP(概要版1!D724,一覧表!$E:$X,20,FALSE)","v":"B"}]
[]
[]
[]
[]
[null,{"$f":"D748","v":"CG-180003-VE"}]
[null,null,null,"CG-180003-VE",null,null,null,{"$f":"\"有用な技術の位置づけ：\"&VLOOKUP(D748,一覧表!$E:$G,3,FALSE)","v":"有用な技術の位置づけ：活用促進"},null,null,null,null,null,null,null,{"$f":"HYPERLINK(\"#一覧表!h\"&MATCH(D748,一覧表!E:E,0),\"一覧表に戻る\")","v":"一覧表に戻る"},{"$f":"Q724+1","v":32}]
[null,null,null,{"$f":"\"（工種 ： \"&VLOOKUP(D748,一覧表!$E:$AE,25,FALSE)&\"－\"&VLOOKUP(D748,一覧表!$E:$AE,26,FALSE)&\"－\"&IF(VLOOKUP(D748,一覧表!$E:$AE,27,FALSE)=\"\",\"　　　　　\",VLOOKUP(D748,一覧表!$E:$AE,27,FALSE))&\"）\"","v":"（工種 ： 調査試験－測量－その他）"}]
[]
[null,null,null,{"$f":"VLOOKUP(D748,一覧表!$E:$L,2,FALSE)","v":"マルチビーム測深機搭載の無人ボートによる深浅測量"}]
[null,null,null,{"$f":"\"  副題 ： \"&VLOOKUP(D748,一覧表!$E:$AA,22,FALSE)","v":"  副題 ： 自動航行機能を有した無人ボートに搭載されたマルチビーム測深を用いた海底地形3次元深浅測量システム"}]
[null,null,null,null,null,null,null,null,null,null,null,null,{"$f":"\"開発者名 ： \"&VLOOKUP(D748,一覧表!$E:$AA,23,FALSE)","v":"開発者名 ： 株式会社東陽テクニカ"}]
[]
[null,null,null,"概要、新規性及び期待される効果等",null,null,null,null,null,null,null,null,"図表等"]
[]
[null,null,null,{"$f":"VLOOKUP(D748,一覧表!$E:$L,7,FALSE)","v":"本技術はマルチビーム音響測深機搭載の無人ボートを用いた水底地形測量で、従来はマルチビーム音響測深機搭載を有人船に搭載して対応していた。本技術の活用により有人船への機器の艤装が不要になり時間や人員が大幅に削減できる。"}]
[null,null,null,"活用の効果"]
[null,null,null,{"$f":"\"比較する従来技術 ： \"&VLOOKUP(D748,一覧表!$E:$L,8,FALSE)","v":"比較する従来技術 ： 有人船(傭船)に搭載したマルチビーム音響測深機を用いた深浅測量"}]
[null,null,null,"項目","申請情報",null,null,null,null,null,"評価結果\n（C：同程度）"]
[null,null,null,"経済性",{"$f":"IF(LEFT(VLOOKUP(概要版1!D748,一覧表!$E:$X,9,FALSE),2)=\"向上\",\"■\",\"□\")","v":"■"},{"$f":"IF(LEFT(VLOOKUP(概要版1!D748,一覧表!$E:$X,9,FALSE),2)=\"向上\",VLOOKUP(概要版1!D748,一覧表!$E:$X,9,FALSE),\"向上\")","v":"向上\n(47%)\n"},{"$f":"IF(VLOOKUP(概要版1!D748,一覧表!$E:$X,9,FALSE)=\"同程度\",\"■\",\"□\")","v":"□"},"同程度",{"$f":"IF(LEFT(VLOOKUP(概要版1!D748,一覧表!$E:$X,9,FALSE),2)=\"低下\",\"■\",\"□\")","v":"□"},{"$f":"IF(LEFT(VLOOKUP(概要版1!D748,一覧表!$E:$X,9,FALSE),2)=\"低下\",VLOOKUP(概要版1!D748,一覧表!$E:$X,9,FALSE),\"低下\")","v":"低下"},{"$f":"VLOOKUP(概要版1!D748,一覧表!$E:$X,15,FALSE)","v":"B"}]
[null,null,null,"工程",{"$f":"IF(LEFT(VLOOKUP(概要版1!D748,一覧表!$E:$X,10,FALSE),2)=\"短縮\",\"■\",\"□\")","v":"■"},{"$f":"IF(LEFT(VLOOKUP(概要版1!D748,一覧表!$E:$X,10,FALSE),2)=\"短縮\",VLOOKUP(概要版1!D748,一覧表!$E:$X,10,FALSE),\"短縮\")","v":"短縮\n(8%)\n"},{"$f":"IF(VLOOKUP(概要版1!D748,一覧表!$E:$X,10,FALSE)=\"同程度\",\"■\",\"□\")","v":"□"},"同程度",{"$f":"IF(LEFT(VLOOKUP(概要版1!D748,一覧表!$E:$X,10,FALSE),2)=\"増加\",\"■\",\"□\")","v":"□"},{"$f":"IF(LEFT(VLOOKUP(概要版1!D748,一覧表!$E:$X,10,FALSE),2)=\"増加\",VLOOKUP(概要版1!D748,一覧表!$E:$X,10,FALSE),\"増加\")","v":"増加"},{"$f":"VLOOKUP(概要版1!D748,一覧表!$E:$X,16,FALSE)","v":"B"}]
[null,null,null,"品質",{"$f":"IF(VLOOKUP(概要版1!D748,一覧表!$E:$X,11,FALSE)=\"向上\",\"■\",\"□\")","v":"□"},"向上",{"$f":"IF(VLOOKUP(概要版1!D748,一覧表!$E:$X,11,FALSE)=\"同程度\",\"■\",\"□\")","v":"■"},"同程度",{"$f":"IF(VLOOKUP(概要版1!D748,一覧表!$E:$X,11,FALSE)=\"低下\",\"■\",\"□\")","v":"□"},"低下",{"$f":"VLOOKUP(概要版1!D748,一覧表!$E:$X,17,FALSE)","v":"C"}]
[null,null,null,"安全性",{"$f":"IF(VLOOKUP(概要版1!D748,一覧表!$E:$X,12,FALSE)=\"向上\",\"■\",\"□\")","v":"■"},"向上",{"$f":"IF(VLOOKUP(概要版1!D748,一覧表!$E:$X,12,FALSE)=\"同程度\",\"■\",\"□\")","v":"□"},"同程度",{"$f":"IF(VLOOKUP(概要版1!D748,一覧表!$E:$X,12,FALSE)=\"低下\",\"■\",\"□\")","v":"□"},"低下",{"$f":"VLOOKUP(概要版1!D748,一覧表!$E:$X,18,FALSE)","v":"B"}]
[null,null,null,"施工性",{"$f":"IF(VLOOKUP(概要版1!D748,一覧表!$E:$X,13,FALSE)=\"向上\",\"■\",\"□\")","v":"■"},"向上",{"$f":"IF(VLOOKUP(概要版1!D748,一覧表!$E:$X,13,FALSE)=\"同程度\",\"■\",\"□\")","v":"□"},"同程度",{"$f":"IF(VLOOKUP(概要版1!D748,一覧表!$E:$X,13,FALSE)=\"低下\",\"■\",\"□\")","v":"□"},"低下",{"$f":"VLOOKUP(概要版1!D748,一覧表!$E:$X,19,FALSE)","v":"A"}]
[null,null,null,"環境",{"$f":"IF(VLOOKUP(概要版1!D748,一覧表!$E:$X,14,FALSE)=\"向上\",\"■\",\"□\")","v":"■"},"向上",{"$f":"IF(VLOOKUP(概要版1!D748,一覧表!$E:$X,14,FALSE)=\"同程度\",\"■\",\"□\")","v":"□"},"同程度",{"$f":"IF(VLOOKUP(概要版1!D748,一覧表!$E:$X,14,FALSE)=\"低下\",\"■\",\"□\")","v":"□"},"低下",{"$f":"VLOOKUP(概要版1!D748,一覧表!$E:$X,20,FALSE)","v":"B"}]
[]
[]
[]
[]
[null,{"$f":"D772","v":"HR-130013-VE"}]
[null,null,null,"HR-130013-VE",null,null,null,{"$f":"\"有用な技術の位置づけ：\"&VLOOKUP(D772,一覧表!$E:$G,3,FALSE)","v":"有用な技術の位置づけ：活用促進"},null,null,null,null,null,null,null,{"$f":"HYPERLINK(\"#一覧表!h\"&MATCH(D772,一覧表!E:E,0),\"一覧表に戻る\")","v":"一覧表に戻る"},{"$f":"Q748+1","v":33}]
[null,null,null,{"$f":"\"（工種 ： \"&VLOOKUP(D772,一覧表!$E:$AE,25,FALSE)&\"－\"&VLOOKUP(D772,一覧表!$E:$AE,26,FALSE)&\"－\"&IF(VLOOKUP(D772,一覧表!$E:$AE,27,FALSE)=\"\",\"　　　　　\",VLOOKUP(D772,一覧表!$E:$AE,27,FALSE))&\"）\"","v":"（工種 ： 調査試験－地質調査－地下調査）"}]
[]
[null,null,null,{"$f":"VLOOKUP(D772,一覧表!$E:$L,2,FALSE)","v":"スケルカ・陥没防止技術(路面下空洞調査)"}]
[null,null,null,{"$f":"\"  副題 ： \"&VLOOKUP(D772,一覧表!$E:$AA,22,FALSE)","v":"  副題 ： 高速・高解像度3次元地中レーダ技術による路面下空洞調査技術"}]
[null,null,null,null,null,null,null,null,null,null,null,null,{"$f":"\"開発者名 ： \"&VLOOKUP(D772,一覧表!$E:$AA,23,FALSE)","v":"開発者名 ： ジオ・サーチ株式会社"}]
[]
[null,null,null,"概要、新規性及び期待される効果等",null,null,null,null,null,null,null,null,"図表等"]
[]
[null,null,null,{"$f":"VLOOKUP(D772,一覧表!$E:$L,7,FALSE)","v":"道路等の表面下の空洞を探査車(SKELE-CAR)で調査する技術で、従来は、探査車(7CH)による一次調査+メッシュ調査で対応していた。本技術の活用により、メッシュ調査が不要になり経済性・施工性・安全性が向上し、工程が短縮される。"}]
[null,null,null,"活用の効果"]
[null,null,null,{"$f":"\"比較する従来技術 ： \"&VLOOKUP(D772,一覧表!$E:$L,8,FALSE)","v":"比較する従来技術 ： 探査車(7CHアンテナ)による一次調査+ハンディ型地中レーダによるメッシュ調査"}]
[null,null,null,"項目","申請情報",null,null,null,null,null,"評価結果\n（C：同程度）"]
[null,null,null,"経済性",{"$f":"IF(LEFT(VLOOKUP(概要版1!D772,一覧表!$E:$X,9,FALSE),2)=\"向上\",\"■\",\"□\")","v":"■"},{"$f":"IF(LEFT(VLOOKUP(概要版1!D772,一覧表!$E:$X,9,FALSE),2)=\"向上\",VLOOKUP(概要版1!D772,一覧表!$E:$X,9,FALSE),\"向上\")","v":"向上\n(20%)\n"},{"$f":"IF(VLOOKUP(概要版1!D772,一覧表!$E:$X,9,FALSE)=\"同程度\",\"■\",\"□\")","v":"□"},"同程度",{"$f":"IF(LEFT(VLOOKUP(概要版1!D772,一覧表!$E:$X,9,FALSE),2)=\"低下\",\"■\",\"□\")","v":"□"},{"$f":"IF(LEFT(VLOOKUP(概要版1!D772,一覧表!$E:$X,9,FALSE),2)=\"低下\",VLOOKUP(概要版1!D772,一覧表!$E:$X,9,FALSE),\"低下\")","v":"低下"},{"$f":"VLOOKUP(概要版1!D772,一覧表!$E:$X,15,FALSE)","v":"A"}]
[null,null,null,"工程",{"$f":"IF(LEFT(VLOOKUP(概要版1!D772,一覧表!$E:$X,10,FALSE),2)=\"短縮\",\"■\",\"□\")","v":"■"},{"$f":"IF(LEFT(VLOOKUP(概要版1!D772,一覧表!$E:$X,10,FALSE),2)=\"短縮\",VLOOKUP(概要版1!D772,一覧表!$E:$X,10,FALSE),\"短縮\")","v":"短縮\n(33%)\n"},{"$f":"IF(VLOOKUP(概要版1!D772,一覧表!$E:$X,10,FALSE)=\"同程度\",\"■\",\"□\")","v":"□"},"同程度",{"$f":"IF(LEFT(VLOOKUP(概要版1!D772,一覧表!$E:$X,10,FALSE),2)=\"増加\",\"■\",\"□\")","v":"□"},{"$f":"IF(LEFT(VLOOKUP(概要版1!D772,一覧表!$E:$X,10,FALSE),2)=\"増加\",VLOOKUP(概要版1!D772,一覧表!$E:$X,10,FALSE),\"増加\")","v":"増加"},{"$f":"VLOOKUP(概要版1!D772,一覧表!$E:$X,16,FALSE)","v":"A"}]
[null,null,null,"品質",{"$f":"IF(VLOOKUP(概要版1!D772,一覧表!$E:$X,11,FALSE)=\"向上\",\"■\",\"□\")","v":"■"},"向上",{"$f":"IF(VLOOKUP(概要版1!D772,一覧表!$E:$X,11,FALSE)=\"同程度\",\"■\",\"□\")","v":"□"},"同程度",{"$f":"IF(VLOOKUP(概要版1!D772,一覧表!$E:$X,11,FALSE)=\"低下\",\"■\",\"□\")","v":"□"},"低下",{"$f":"VLOOKUP(概要版1!D772,一覧表!$E:$X,17,FALSE)","v":"A"}]
[null,null,null,"安全性",{"$f":"IF(VLOOKUP(概要版1!D772,一覧表!$E:$X,12,FALSE)=\"向上\",\"■\",\"□\")","v":"■"},"向上",{"$f":"IF(VLOOKUP(概要版1!D772,一覧表!$E:$X,12,FALSE)=\"同程度\",\"■\",\"□\")","v":"□"},"同程度",{"$f":"IF(VLOOKUP(概要版1!D772,一覧表!$E:$X,12,FALSE)=\"低下\",\"■\",\"□\")","v":"□"},"低下",{"$f":"VLOOKUP(概要版1!D772,一覧表!$E:$X,18,FALSE)","v":"B"}]
[null,null,null,"施工性",{"$f":"IF(VLOOKUP(概要版1!D772,一覧表!$E:$X,13,FALSE)=\"向上\",\"■\",\"□\")","v":"■"},"向上",{"$f":"IF(VLOOKUP(概要版1!D772,一覧表!$E:$X,13,FALSE)=\"同程度\",\"■\",\"□\")","v":"□"},"同程度",{"$f":"IF(VLOOKUP(概要版1!D772,一覧表!$E:$X,13,FALSE)=\"低下\",\"■\",\"□\")","v":"□"},"低下",{"$f":"VLOOKUP(概要版1!D772,一覧表!$E:$X,19,FALSE)","v":"A"}]
[null,null,null,"環境",{"$f":"IF(VLOOKUP(概要版1!D772,一覧表!$E:$X,14,FALSE)=\"向上\",\"■\",\"□\")","v":"■"},"向上",{"$f":"IF(VLOOKUP(概要版1!D772,一覧表!$E:$X,14,FALSE)=\"同程度\",\"■\",\"□\")","v":"□"},"同程度",{"$f":"IF(VLOOKUP(概要版1!D772,一覧表!$E:$X,14,FALSE)=\"低下\",\"■\",\"□\")","v":"□"},"低下",{"$f":"VLOOKUP(概要版1!D772,一覧表!$E:$X,20,FALSE)","v":"B"}]
[]
[]
[]
[]
[null,{"$f":"D796","v":"CB-150004-VE"}]
[null,null,null,"CB-150004-VE",null,null,null,{"$f":"\"有用な技術の位置づけ：\"&VLOOKUP(D796,一覧表!$E:$G,3,FALSE)","v":"有用な技術の位置づけ：活用促進"},null,null,null,null,null,null,null,{"$f":"HYPERLINK(\"#一覧表!h\"&MATCH(D796,一覧表!E:E,0),\"一覧表に戻る\")","v":"一覧表に戻る"},{"$f":"Q772+1","v":34}]
[null,null,null,{"$f":"\"（工種 ： \"&VLOOKUP(D796,一覧表!$E:$AE,25,FALSE)&\"－\"&VLOOKUP(D796,一覧表!$E:$AE,26,FALSE)&\"－\"&IF(VLOOKUP(D796,一覧表!$E:$AE,27,FALSE)=\"\",\"　　　　　\",VLOOKUP(D796,一覧表!$E:$AE,27,FALSE))&\"）\"","v":"（工種 ： 調査試験－構造物調査－非破壊試験、調査）"}]
[]
[null,null,null,{"$f":"VLOOKUP(D796,一覧表!$E:$L,2,FALSE)","v":"橋面舗装・床版上部非破壊調査システム(床版キャッチャー)"}]
[null,null,null,{"$f":"\"  副題 ： \"&VLOOKUP(D796,一覧表!$E:$AA,22,FALSE)","v":"  副題 ： 3次元電磁波技術の解析手法を改善した床版劣化調査技術"}]
[null,null,null,null,null,null,null,null,null,null,null,null,{"$f":"\"開発者名 ： \"&VLOOKUP(D796,一覧表!$E:$AA,23,FALSE)","v":"開発者名 ： ニチレキ株式会社 "}]
[]
[null,null,null,"概要、新規性及び期待される効果等",null,null,null,null,null,null,null,null,"図表等"]
[]
[null,null,null,{"$f":"VLOOKUP(D796,一覧表!$E:$L,7,FALSE)","v":"本技術は、電磁波解析手法を改善した床版劣化調査技術であり、従来の電磁波調査は解析者の個人誤差を含むものであった。本技術の活用により、定量化された解析判断基準から、解析者によらず精度良く床版の損傷範囲を把握できる。"}]
[null,null,null,"活用の効果"]
[null,null,null,{"$f":"\"比較する従来技術 ： \"&VLOOKUP(D796,一覧表!$E:$L,8,FALSE)","v":"比較する従来技術 ： 舗装路面の目視調査、地中レーダ調査(空洞調査) "}]
[null,null,null,"項目","申請情報",null,null,null,null,null,"評価結果\n（C：同程度）"]
[null,null,null,"経済性",{"$f":"IF(LEFT(VLOOKUP(概要版1!D796,一覧表!$E:$X,9,FALSE),2)=\"向上\",\"■\",\"□\")","v":"■"},{"$f":"IF(LEFT(VLOOKUP(概要版1!D796,一覧表!$E:$X,9,FALSE),2)=\"向上\",VLOOKUP(概要版1!D796,一覧表!$E:$X,9,FALSE),\"向上\")","v":"向上\n(81%)\n"},{"$f":"IF(VLOOKUP(概要版1!D796,一覧表!$E:$X,9,FALSE)=\"同程度\",\"■\",\"□\")","v":"□"},"同程度",{"$f":"IF(LEFT(VLOOKUP(概要版1!D796,一覧表!$E:$X,9,FALSE),2)=\"低下\",\"■\",\"□\")","v":"□"},{"$f":"IF(LEFT(VLOOKUP(概要版1!D796,一覧表!$E:$X,9,FALSE),2)=\"低下\",VLOOKUP(概要版1!D796,一覧表!$E:$X,9,FALSE),\"低下\")","v":"低下"},{"$f":"VLOOKUP(概要版1!D796,一覧表!$E:$X,15,FALSE)","v":"B"}]
[null,null,null,"工程",{"$f":"IF(LEFT(VLOOKUP(概要版1!D796,一覧表!$E:$X,10,FALSE),2)=\"短縮\",\"■\",\"□\")","v":"■"},{"$f":"IF(LEFT(VLOOKUP(概要版1!D796,一覧表!$E:$X,10,FALSE),2)=\"短縮\",VLOOKUP(概要版1!D796,一覧表!$E:$X,10,FALSE),\"短縮\")","v":"短縮\n(35%)\n"},{"$f":"IF(VLOOKUP(概要版1!D796,一覧表!$E:$X,10,FALSE)=\"同程度\",\"■\",\"□\")","v":"□"},"同程度",{"$f":"IF(LEFT(VLOOKUP(概要版1!D796,一覧表!$E:$X,10,FALSE),2)=\"増加\",\"■\",\"□\")","v":"□"},{"$f":"IF(LEFT(VLOOKUP(概要版1!D796,一覧表!$E:$X,10,FALSE),2)=\"増加\",VLOOKUP(概要版1!D796,一覧表!$E:$X,10,FALSE),\"増加\")","v":"増加"},{"$f":"VLOOKUP(概要版1!D796,一覧表!$E:$X,16,FALSE)","v":"B"}]
[null,null,null,"品質",{"$f":"IF(VLOOKUP(概要版1!D796,一覧表!$E:$X,11,FALSE)=\"向上\",\"■\",\"□\")","v":"■"},"向上",{"$f":"IF(VLOOKUP(概要版1!D796,一覧表!$E:$X,11,FALSE)=\"同程度\",\"■\",\"□\")","v":"□"},"同程度",{"$f":"IF(VLOOKUP(概要版1!D796,一覧表!$E:$X,11,FALSE)=\"低下\",\"■\",\"□\")","v":"□"},"低下",{"$f":"VLOOKUP(概要版1!D796,一覧表!$E:$X,17,FALSE)","v":"C"}]
[null,null,null,"安全性",{"$f":"IF(VLOOKUP(概要版1!D796,一覧表!$E:$X,12,FALSE)=\"向上\",\"■\",\"□\")","v":"■"},"向上",{"$f":"IF(VLOOKUP(概要版1!D796,一覧表!$E:$X,12,FALSE)=\"同程度\",\"■\",\"□\")","v":"□"},"同程度",{"$f":"IF(VLOOKUP(概要版1!D796,一覧表!$E:$X,12,FALSE)=\"低下\",\"■\",\"□\")","v":"□"},"低下",{"$f":"VLOOKUP(概要版1!D796,一覧表!$E:$X,18,FALSE)","v":"B"}]
[null,null,null,"施工性",{"$f":"IF(VLOOKUP(概要版1!D796,一覧表!$E:$X,13,FALSE)=\"向上\",\"■\",\"□\")","v":"■"},"向上",{"$f":"IF(VLOOKUP(概要版1!D796,一覧表!$E:$X,13,FALSE)=\"同程度\",\"■\",\"□\")","v":"□"},"同程度",{"$f":"IF(VLOOKUP(概要版1!D796,一覧表!$E:$X,13,FALSE)=\"低下\",\"■\",\"□\")","v":"□"},"低下",{"$f":"VLOOKUP(概要版1!D796,一覧表!$E:$X,19,FALSE)","v":"B"}]
[null,null,null,"環境",{"$f":"IF(VLOOKUP(概要版1!D796,一覧表!$E:$X,14,FALSE)=\"向上\",\"■\",\"□\")","v":"■"},"向上",{"$f":"IF(VLOOKUP(概要版1!D796,一覧表!$E:$X,14,FALSE)=\"同程度\",\"■\",\"□\")","v":"□"},"同程度",{"$f":"IF(VLOOKUP(概要版1!D796,一覧表!$E:$X,14,FALSE)=\"低下\",\"■\",\"□\")","v":"□"},"低下",{"$f":"VLOOKUP(概要版1!D796,一覧表!$E:$X,20,FALSE)","v":"B"}]
[]
[]
[]
[]
[null,{"$f":"D820","v":"KT-160111-VE"}]
[null,null,null,"KT-160111-VE",null,null,null,{"$f":"\"有用な技術の位置づけ：\"&VLOOKUP(D820,一覧表!$E:$G,3,FALSE)","v":"有用な技術の位置づけ：活用促進"},null,null,null,null,null,null,null,{"$f":"HYPERLINK(\"#一覧表!h\"&MATCH(D820,一覧表!E:E,0),\"一覧表に戻る\")","v":"一覧表に戻る"},{"$f":"Q796+1","v":35}]
[null,null,null,{"$f":"\"（工種 ： \"&VLOOKUP(D820,一覧表!$E:$AE,25,FALSE)&\"－\"&VLOOKUP(D820,一覧表!$E:$AE,26,FALSE)&\"－\"&IF(VLOOKUP(D820,一覧表!$E:$AE,27,FALSE)=\"\",\"　　　　　\",VLOOKUP(D820,一覧表!$E:$AE,27,FALSE))&\"）\"","v":"（工種 ： 調査試験－構造物調査－非破壊試験、調査）"}]
[]
[null,null,null,{"$f":"VLOOKUP(D820,一覧表!$E:$L,2,FALSE)","v":"プロテスターTRシリーズ"}]
[null,null,null,{"$f":"\"  副題 ： \"&VLOOKUP(D820,一覧表!$E:$AA,22,FALSE)","v":"  副題 ： あと施工アンカーボルト引張荷重確認試験機"}]
[null,null,null,null,null,null,null,null,null,null,null,null,{"$f":"\"開発者名 ： \"&VLOOKUP(D820,一覧表!$E:$AA,23,FALSE)","v":"開発者名 ： 株式会社トラスト"}]
[]
[null,null,null,"概要、新規性及び期待される効果等",null,null,null,null,null,null,null,null,"図表等"]
[]
[null,null,null,{"$f":"VLOOKUP(D820,一覧表!$E:$L,7,FALSE)","v":"本技術は、あと施工アンカーボルトの施工強度を人力で計測する引張荷重確認試験機であり、従来は油圧式アンカーボルト引張荷重検査器で対応していた。本技術の活用により、取付物を取り外さずに計測可能となり、工期短縮・省力化・省人化による経済性の向上が図れます。"}]
[null,null,null,"活用の効果"]
[null,null,null,{"$f":"\"比較する従来技術 ： \"&VLOOKUP(D820,一覧表!$E:$L,8,FALSE)","v":"比較する従来技術 ： 油圧式アンカーボルト引張荷重検査器 "}]
[null,null,null,"項目","申請情報",null,null,null,null,null,"評価結果\n（C：同程度）"]
[null,null,null,"経済性",{"$f":"IF(LEFT(VLOOKUP(概要版1!D820,一覧表!$E:$X,9,FALSE),2)=\"向上\",\"■\",\"□\")","v":"■"},{"$f":"IF(LEFT(VLOOKUP(概要版1!D820,一覧表!$E:$X,9,FALSE),2)=\"向上\",VLOOKUP(概要版1!D820,一覧表!$E:$X,9,FALSE),\"向上\")","v":"向上\n(51%)\n"},{"$f":"IF(VLOOKUP(概要版1!D820,一覧表!$E:$X,9,FALSE)=\"同程度\",\"■\",\"□\")","v":"□"},"同程度",{"$f":"IF(LEFT(VLOOKUP(概要版1!D820,一覧表!$E:$X,9,FALSE),2)=\"低下\",\"■\",\"□\")","v":"□"},{"$f":"IF(LEFT(VLOOKUP(概要版1!D820,一覧表!$E:$X,9,FALSE),2)=\"低下\",VLOOKUP(概要版1!D820,一覧表!$E:$X,9,FALSE),\"低下\")","v":"低下"},{"$f":"VLOOKUP(概要版1!D820,一覧表!$E:$X,15,FALSE)","v":"B"}]
[null,null,null,"工程",{"$f":"IF(LEFT(VLOOKUP(概要版1!D820,一覧表!$E:$X,10,FALSE),2)=\"短縮\",\"■\",\"□\")","v":"■"},{"$f":"IF(LEFT(VLOOKUP(概要版1!D820,一覧表!$E:$X,10,FALSE),2)=\"短縮\",VLOOKUP(概要版1!D820,一覧表!$E:$X,10,FALSE),\"短縮\")","v":"短縮\n(67%)\n"},{"$f":"IF(VLOOKUP(概要版1!D820,一覧表!$E:$X,10,FALSE)=\"同程度\",\"■\",\"□\")","v":"□"},"同程度",{"$f":"IF(LEFT(VLOOKUP(概要版1!D820,一覧表!$E:$X,10,FALSE),2)=\"増加\",\"■\",\"□\")","v":"□"},{"$f":"IF(LEFT(VLOOKUP(概要版1!D820,一覧表!$E:$X,10,FALSE),2)=\"増加\",VLOOKUP(概要版1!D820,一覧表!$E:$X,10,FALSE),\"増加\")","v":"増加"},{"$f":"VLOOKUP(概要版1!D820,一覧表!$E:$X,16,FALSE)","v":"B"}]
[null,null,null,"品質",{"$f":"IF(VLOOKUP(概要版1!D820,一覧表!$E:$X,11,FALSE)=\"向上\",\"■\",\"□\")","v":"■"},"向上",{"$f":"IF(VLOOKUP(概要版1!D820,一覧表!$E:$X,11,FALSE)=\"同程度\",\"■\",\"□\")","v":"□"},"同程度",{"$f":"IF(VLOOKUP(概要版1!D820,一覧表!$E:$X,11,FALSE)=\"低下\",\"■\",\"□\")","v":"□"},"低下",{"$f":"VLOOKUP(概要版1!D820,一覧表!$E:$X,17,FALSE)","v":"B"}]
[null,null,null,"安全性",{"$f":"IF(VLOOKUP(概要版1!D820,一覧表!$E:$X,12,FALSE)=\"向上\",\"■\",\"□\")","v":"□"},"向上",{"$f":"IF(VLOOKUP(概要版1!D820,一覧表!$E:$X,12,FALSE)=\"同程度\",\"■\",\"□\")","v":"■"},"同程度",{"$f":"IF(VLOOKUP(概要版1!D820,一覧表!$E:$X,12,FALSE)=\"低下\",\"■\",\"□\")","v":"□"},"低下",{"$f":"VLOOKUP(概要版1!D820,一覧表!$E:$X,18,FALSE)","v":"B"}]
[null,null,null,"施工性",{"$f":"IF(VLOOKUP(概要版1!D820,一覧表!$E:$X,13,FALSE)=\"向上\",\"■\",\"□\")","v":"■"},"向上",{"$f":"IF(VLOOKUP(概要版1!D820,一覧表!$E:$X,13,FALSE)=\"同程度\",\"■\",\"□\")","v":"□"},"同程度",{"$f":"IF(VLOOKUP(概要版1!D820,一覧表!$E:$X,13,FALSE)=\"低下\",\"■\",\"□\")","v":"□"},"低下",{"$f":"VLOOKUP(概要版1!D820,一覧表!$E:$X,19,FALSE)","v":"A"}]
[null,null,null,"環境",{"$f":"IF(VLOOKUP(概要版1!D820,一覧表!$E:$X,14,FALSE)=\"向上\",\"■\",\"□\")","v":"□"},"向上",{"$f":"IF(VLOOKUP(概要版1!D820,一覧表!$E:$X,14,FALSE)=\"同程度\",\"■\",\"□\")","v":"■"},"同程度",{"$f":"IF(VLOOKUP(概要版1!D820,一覧表!$E:$X,14,FALSE)=\"低下\",\"■\",\"□\")","v":"□"},"低下",{"$f":"VLOOKUP(概要版1!D820,一覧表!$E:$X,20,FALSE)","v":"C"}]
[]
[]
[]
[]
[null,{"$f":"D844","v":"KT-170007-VE"}]
[null,null,null,"KT-170007-VE",null,null,null,{"$f":"\"有用な技術の位置づけ：\"&VLOOKUP(D844,一覧表!$E:$G,3,FALSE)","v":"有用な技術の位置づけ：活用促進"},null,null,null,null,null,null,null,{"$f":"HYPERLINK(\"#一覧表!h\"&MATCH(D844,一覧表!E:E,0),\"一覧表に戻る\")","v":"一覧表に戻る"},{"$f":"Q820+1","v":36}]
[null,null,null,{"$f":"\"（工種 ： \"&VLOOKUP(D844,一覧表!$E:$AE,25,FALSE)&\"－\"&VLOOKUP(D844,一覧表!$E:$AE,26,FALSE)&\"－\"&IF(VLOOKUP(D844,一覧表!$E:$AE,27,FALSE)=\"\",\"　　　　　\",VLOOKUP(D844,一覧表!$E:$AE,27,FALSE))&\"）\"","v":"（工種 ： 調査試験－構造物調査－非破壊試験、調査）"}]
[]
[null,null,null,{"$f":"VLOOKUP(D844,一覧表!$E:$L,2,FALSE)","v":"アンカーボルト引張荷重の一体型試験測定システム(テクノテスターシリーズ)"}]
[null,null,null,{"$f":"\"  副題 ： \"&VLOOKUP(D844,一覧表!$E:$AA,22,FALSE)","v":"  副題 ： 引張り試験からデータ管理まで簡便に行える一体型アンカーボルト引張荷重確認試験機"}]
[null,null,null,null,null,null,null,null,null,null,null,null,{"$f":"\"開発者名 ： \"&VLOOKUP(D844,一覧表!$E:$AA,23,FALSE)","v":"開発者名 ： サンコーテクノ株式会社"}]
[]
[null,null,null,"概要、新規性及び期待される効果等",null,null,null,null,null,null,null,null,"図表等"]
[]
[null,null,null,{"$f":"VLOOKUP(D844,一覧表!$E:$L,7,FALSE)","v":"本技術は一体型アンカーボルト引張荷重試験機で従来は油圧シリンダ、反力台などを用いたアンカーボルト引張荷重試験機で対応していた。本技術の活用により多くの引張試験を行う際の組立作業の軽減と、データ保存もできる効果により安全性の向上と工程の短縮が図れる。 "}]
[null,null,null,"活用の効果"]
[null,null,null,{"$f":"\"比較する従来技術 ： \"&VLOOKUP(D844,一覧表!$E:$L,8,FALSE)","v":"比較する従来技術 ： 油圧シリンダ、反力台などを用いたアンカーボルト引張荷重試験機"}]
[null,null,null,"項目","申請情報",null,null,null,null,null,"評価結果\n（C：同程度）"]
[null,null,null,"経済性",{"$f":"IF(LEFT(VLOOKUP(概要版1!D844,一覧表!$E:$X,9,FALSE),2)=\"向上\",\"■\",\"□\")","v":"■"},{"$f":"IF(LEFT(VLOOKUP(概要版1!D844,一覧表!$E:$X,9,FALSE),2)=\"向上\",VLOOKUP(概要版1!D844,一覧表!$E:$X,9,FALSE),\"向上\")","v":"向上\n(33%)\n"},{"$f":"IF(VLOOKUP(概要版1!D844,一覧表!$E:$X,9,FALSE)=\"同程度\",\"■\",\"□\")","v":"□"},"同程度",{"$f":"IF(LEFT(VLOOKUP(概要版1!D844,一覧表!$E:$X,9,FALSE),2)=\"低下\",\"■\",\"□\")","v":"□"},{"$f":"IF(LEFT(VLOOKUP(概要版1!D844,一覧表!$E:$X,9,FALSE),2)=\"低下\",VLOOKUP(概要版1!D844,一覧表!$E:$X,9,FALSE),\"低下\")","v":"低下"},{"$f":"VLOOKUP(概要版1!D844,一覧表!$E:$X,15,FALSE)","v":"B"}]
[null,null,null,"工程",{"$f":"IF(LEFT(VLOOKUP(概要版1!D844,一覧表!$E:$X,10,FALSE),2)=\"短縮\",\"■\",\"□\")","v":"■"},{"$f":"IF(LEFT(VLOOKUP(概要版1!D844,一覧表!$E:$X,10,FALSE),2)=\"短縮\",VLOOKUP(概要版1!D844,一覧表!$E:$X,10,FALSE),\"短縮\")","v":"短縮\n(50%)\n"},{"$f":"IF(VLOOKUP(概要版1!D844,一覧表!$E:$X,10,FALSE)=\"同程度\",\"■\",\"□\")","v":"□"},"同程度",{"$f":"IF(LEFT(VLOOKUP(概要版1!D844,一覧表!$E:$X,10,FALSE),2)=\"増加\",\"■\",\"□\")","v":"□"},{"$f":"IF(LEFT(VLOOKUP(概要版1!D844,一覧表!$E:$X,10,FALSE),2)=\"増加\",VLOOKUP(概要版1!D844,一覧表!$E:$X,10,FALSE),\"増加\")","v":"増加"},{"$f":"VLOOKUP(概要版1!D844,一覧表!$E:$X,16,FALSE)","v":"B"}]
[null,null,null,"品質",{"$f":"IF(VLOOKUP(概要版1!D844,一覧表!$E:$X,11,FALSE)=\"向上\",\"■\",\"□\")","v":"■"},"向上",{"$f":"IF(VLOOKUP(概要版1!D844,一覧表!$E:$X,11,FALSE)=\"同程度\",\"■\",\"□\")","v":"□"},"同程度",{"$f":"IF(VLOOKUP(概要版1!D844,一覧表!$E:$X,11,FALSE)=\"低下\",\"■\",\"□\")","v":"□"},"低下",{"$f":"VLOOKUP(概要版1!D844,一覧表!$E:$X,17,FALSE)","v":"B"}]
[null,null,null,"安全性",{"$f":"IF(VLOOKUP(概要版1!D844,一覧表!$E:$X,12,FALSE)=\"向上\",\"■\",\"□\")","v":"■"},"向上",{"$f":"IF(VLOOKUP(概要版1!D844,一覧表!$E:$X,12,FALSE)=\"同程度\",\"■\",\"□\")","v":"□"},"同程度",{"$f":"IF(VLOOKUP(概要版1!D844,一覧表!$E:$X,12,FALSE)=\"低下\",\"■\",\"□\")","v":"□"},"低下",{"$f":"VLOOKUP(概要版1!D844,一覧表!$E:$X,18,FALSE)","v":"C"}]
[null,null,null,"施工性",{"$f":"IF(VLOOKUP(概要版1!D844,一覧表!$E:$X,13,FALSE)=\"向上\",\"■\",\"□\")","v":"□"},"向上",{"$f":"IF(VLOOKUP(概要版1!D844,一覧表!$E:$X,13,FALSE)=\"同程度\",\"■\",\"□\")","v":"■"},"同程度",{"$f":"IF(VLOOKUP(概要版1!D844,一覧表!$E:$X,13,FALSE)=\"低下\",\"■\",\"□\")","v":"□"},"低下",{"$f":"VLOOKUP(概要版1!D844,一覧表!$E:$X,19,FALSE)","v":"B"}]
[null,null,null,"環境",{"$f":"IF(VLOOKUP(概要版1!D844,一覧表!$E:$X,14,FALSE)=\"向上\",\"■\",\"□\")","v":"□"},"向上",{"$f":"IF(VLOOKUP(概要版1!D844,一覧表!$E:$X,14,FALSE)=\"同程度\",\"■\",\"□\")","v":"■"},"同程度",{"$f":"IF(VLOOKUP(概要版1!D844,一覧表!$E:$X,14,FALSE)=\"低下\",\"■\",\"□\")","v":"□"},"低下",{"$f":"VLOOKUP(概要版1!D844,一覧表!$E:$X,20,FALSE)","v":"C"}]
[]
[]
[]
[]
[null,{"$f":"D868","v":"KK-130026-VE"}]
[null,null,null,"KK-130026-VE",null,null,null,{"$f":"\"有用な技術の位置づけ：\"&VLOOKUP(D868,一覧表!$E:$G,3,FALSE)","v":"有用な技術の位置づけ：活用促進"},null,null,null,null,null,null,null,{"$f":"HYPERLINK(\"#一覧表!h\"&MATCH(D868,一覧表!E:E,0),\"一覧表に戻る\")","v":"一覧表に戻る"},{"$f":"Q844+1","v":37}]
[null,null,null,{"$f":"\"（工種 ： \"&VLOOKUP(D868,一覧表!$E:$AE,25,FALSE)&\"－\"&VLOOKUP(D868,一覧表!$E:$AE,26,FALSE)&\"－\"&IF(VLOOKUP(D868,一覧表!$E:$AE,27,FALSE)=\"\",\"　　　　　\",VLOOKUP(D868,一覧表!$E:$AE,27,FALSE))&\"）\"","v":"（工種 ： 調査試験－構造物調査－非破壊試験、調査）"}]
[]
[null,null,null,{"$f":"VLOOKUP(D868,一覧表!$E:$L,2,FALSE)","v":"走行型高速3Dトンネル点検システム MIMM(ミーム)"}]
[null,null,null,{"$f":"\"  副題 ： \"&VLOOKUP(D868,一覧表!$E:$AA,22,FALSE)","v":"  副題 ： 点検時の交通規制が不要で、高速走行しながらトンネル覆工壁面カラー画像と高精度な三次元空間位置データを効率よく取得するシステム"}]
[null,null,null,null,null,null,null,null,null,null,null,null,{"$f":"\"開発者名 ： \"&VLOOKUP(D868,一覧表!$E:$AA,23,FALSE)","v":"開発者名 ： 計測検査株式会社、パシフィックコンサルタンツ株式会社"}]
[]
[null,null,null,"概要、新規性及び期待される効果等",null,null,null,null,null,null,null,null,"図表等"]
[]
[null,null,null,{"$f":"VLOOKUP(D868,一覧表!$E:$L,7,FALSE)","v":"本技術は道路トンネル定期点検を車両の高速走行で覆工面カラー画像と3次元空間位置データを計測するシステムで、従来は近接目視点検で対応していた。本技術の活用により、経済性・安全性・点検精度の向上、効率化、正確・客観的な変状展開図作成が可能となる。"}]
[null,null,null,"活用の効果"]
[null,null,null,{"$f":"\"比較する従来技術 ： \"&VLOOKUP(D868,一覧表!$E:$L,8,FALSE)","v":"比較する従来技術 ： 道路トンネル定期点検(応急措置含む)"}]
[null,null,null,"項目","申請情報",null,null,null,null,null,"評価結果\n（C：同程度）"]
[null,null,null,"経済性",{"$f":"IF(LEFT(VLOOKUP(概要版1!D868,一覧表!$E:$X,9,FALSE),2)=\"向上\",\"■\",\"□\")","v":"■"},{"$f":"IF(LEFT(VLOOKUP(概要版1!D868,一覧表!$E:$X,9,FALSE),2)=\"向上\",VLOOKUP(概要版1!D868,一覧表!$E:$X,9,FALSE),\"向上\")","v":"向上\n(20%)\n"},{"$f":"IF(VLOOKUP(概要版1!D868,一覧表!$E:$X,9,FALSE)=\"同程度\",\"■\",\"□\")","v":"□"},"同程度",{"$f":"IF(LEFT(VLOOKUP(概要版1!D868,一覧表!$E:$X,9,FALSE),2)=\"低下\",\"■\",\"□\")","v":"□"},{"$f":"IF(LEFT(VLOOKUP(概要版1!D868,一覧表!$E:$X,9,FALSE),2)=\"低下\",VLOOKUP(概要版1!D868,一覧表!$E:$X,9,FALSE),\"低下\")","v":"低下"},{"$f":"VLOOKUP(概要版1!D868,一覧表!$E:$X,15,FALSE)","v":"C"}]
[null,null,null,"工程",{"$f":"IF(LEFT(VLOOKUP(概要版1!D868,一覧表!$E:$X,10,FALSE),2)=\"短縮\",\"■\",\"□\")","v":"■"},{"$f":"IF(LEFT(VLOOKUP(概要版1!D868,一覧表!$E:$X,10,FALSE),2)=\"短縮\",VLOOKUP(概要版1!D868,一覧表!$E:$X,10,FALSE),\"短縮\")","v":"短縮\n(58%)\n"},{"$f":"IF(VLOOKUP(概要版1!D868,一覧表!$E:$X,10,FALSE)=\"同程度\",\"■\",\"□\")","v":"□"},"同程度",{"$f":"IF(LEFT(VLOOKUP(概要版1!D868,一覧表!$E:$X,10,FALSE),2)=\"増加\",\"■\",\"□\")","v":"□"},{"$f":"IF(LEFT(VLOOKUP(概要版1!D868,一覧表!$E:$X,10,FALSE),2)=\"増加\",VLOOKUP(概要版1!D868,一覧表!$E:$X,10,FALSE),\"増加\")","v":"増加"},{"$f":"VLOOKUP(概要版1!D868,一覧表!$E:$X,16,FALSE)","v":"B"}]
[null,null,null,"品質",{"$f":"IF(VLOOKUP(概要版1!D868,一覧表!$E:$X,11,FALSE)=\"向上\",\"■\",\"□\")","v":"■"},"向上",{"$f":"IF(VLOOKUP(概要版1!D868,一覧表!$E:$X,11,FALSE)=\"同程度\",\"■\",\"□\")","v":"□"},"同程度",{"$f":"IF(VLOOKUP(概要版1!D868,一覧表!$E:$X,11,FALSE)=\"低下\",\"■\",\"□\")","v":"□"},"低下",{"$f":"VLOOKUP(概要版1!D868,一覧表!$E:$X,17,FALSE)","v":"B"}]
[null,null,null,"安全性",{"$f":"IF(VLOOKUP(概要版1!D868,一覧表!$E:$X,12,FALSE)=\"向上\",\"■\",\"□\")","v":"■"},"向上",{"$f":"IF(VLOOKUP(概要版1!D868,一覧表!$E:$X,12,FALSE)=\"同程度\",\"■\",\"□\")","v":"□"},"同程度",{"$f":"IF(VLOOKUP(概要版1!D868,一覧表!$E:$X,12,FALSE)=\"低下\",\"■\",\"□\")","v":"□"},"低下",{"$f":"VLOOKUP(概要版1!D868,一覧表!$E:$X,18,FALSE)","v":"B"}]
[null,null,null,"施工性",{"$f":"IF(VLOOKUP(概要版1!D868,一覧表!$E:$X,13,FALSE)=\"向上\",\"■\",\"□\")","v":"■"},"向上",{"$f":"IF(VLOOKUP(概要版1!D868,一覧表!$E:$X,13,FALSE)=\"同程度\",\"■\",\"□\")","v":"□"},"同程度",{"$f":"IF(VLOOKUP(概要版1!D868,一覧表!$E:$X,13,FALSE)=\"低下\",\"■\",\"□\")","v":"□"},"低下",{"$f":"VLOOKUP(概要版1!D868,一覧表!$E:$X,19,FALSE)","v":"B"}]
[null,null,null,"環境",{"$f":"IF(VLOOKUP(概要版1!D868,一覧表!$E:$X,14,FALSE)=\"向上\",\"■\",\"□\")","v":"■"},"向上",{"$f":"IF(VLOOKUP(概要版1!D868,一覧表!$E:$X,14,FALSE)=\"同程度\",\"■\",\"□\")","v":"□"},"同程度",{"$f":"IF(VLOOKUP(概要版1!D868,一覧表!$E:$X,14,FALSE)=\"低下\",\"■\",\"□\")","v":"□"},"低下",{"$f":"VLOOKUP(概要版1!D868,一覧表!$E:$X,20,FALSE)","v":"B"}]
[]
[]
[]
[]
[null,{"$f":"D892","v":"KT-150087-VE"}]
[null,null,null,"KT-150087-VE",null,null,null,{"$f":"\"有用な技術の位置づけ：\"&VLOOKUP(D892,一覧表!$E:$G,3,FALSE)","v":"有用な技術の位置づけ：活用促進"},null,null,null,null,null,null,null,{"$f":"HYPERLINK(\"#一覧表!h\"&MATCH(D892,一覧表!E:E,0),\"一覧表に戻る\")","v":"一覧表に戻る"},{"$f":"Q868+1","v":38}]
[null,null,null,{"$f":"\"（工種 ： \"&VLOOKUP(D892,一覧表!$E:$AE,25,FALSE)&\"－\"&VLOOKUP(D892,一覧表!$E:$AE,26,FALSE)&\"－\"&IF(VLOOKUP(D892,一覧表!$E:$AE,27,FALSE)=\"\",\"　　　　　\",VLOOKUP(D892,一覧表!$E:$AE,27,FALSE))&\"）\"","v":"（工種 ： 調査試験－構造物調査－非破壊試験、調査）"}]
[]
[null,null,null,{"$f":"VLOOKUP(D892,一覧表!$E:$L,2,FALSE)","v":"アンカープロチェッカー(APC)"}]
[null,null,null,{"$f":"\"  副題 ： \"&VLOOKUP(D892,一覧表!$E:$AA,22,FALSE)","v":"  副題 ： アンカーボルト引張荷重簡易検査器"}]
[null,null,null,null,null,null,null,null,null,null,null,null,{"$f":"\"開発者名 ： \"&VLOOKUP(D892,一覧表!$E:$AA,23,FALSE)","v":"開発者名 ： 株式会社トラスト"}]
[]
[null,null,null,"概要、新規性及び期待される効果等",null,null,null,null,null,null,null,null,"図表等"]
[]
[null,null,null,{"$f":"VLOOKUP(D892,一覧表!$E:$L,7,FALSE)","v":"本技術は、既設のあと施工アンカーボルトの施工強度を人力で検査できる引張荷重簡易検査器であり、従来は油圧式アンカーボルト引張荷重検査器で対応していた。本技術の活用により検査の工程の短縮と省力化が実現でき、経済性と工事の品質の向上が図れます。"}]
[null,null,null,"活用の効果"]
[null,null,null,{"$f":"\"比較する従来技術 ： \"&VLOOKUP(D892,一覧表!$E:$L,8,FALSE)","v":"比較する従来技術 ： 油圧式アンカーボルト引張荷重検査器"}]
[null,null,null,"項目","申請情報",null,null,null,null,null,"評価結果\n（C：同程度）"]
[null,null,null,"経済性",{"$f":"IF(LEFT(VLOOKUP(概要版1!D892,一覧表!$E:$X,9,FALSE),2)=\"向上\",\"■\",\"□\")","v":"■"},{"$f":"IF(LEFT(VLOOKUP(概要版1!D892,一覧表!$E:$X,9,FALSE),2)=\"向上\",VLOOKUP(概要版1!D892,一覧表!$E:$X,9,FALSE),\"向上\")","v":"向上\n(72%)\n"},{"$f":"IF(VLOOKUP(概要版1!D892,一覧表!$E:$X,9,FALSE)=\"同程度\",\"■\",\"□\")","v":"□"},"同程度",{"$f":"IF(LEFT(VLOOKUP(概要版1!D892,一覧表!$E:$X,9,FALSE),2)=\"低下\",\"■\",\"□\")","v":"□"},{"$f":"IF(LEFT(VLOOKUP(概要版1!D892,一覧表!$E:$X,9,FALSE),2)=\"低下\",VLOOKUP(概要版1!D892,一覧表!$E:$X,9,FALSE),\"低下\")","v":"低下"},{"$f":"VLOOKUP(概要版1!D892,一覧表!$E:$X,15,FALSE)","v":"C"}]
[null,null,null,"工程",{"$f":"IF(LEFT(VLOOKUP(概要版1!D892,一覧表!$E:$X,10,FALSE),2)=\"短縮\",\"■\",\"□\")","v":"■"},{"$f":"IF(LEFT(VLOOKUP(概要版1!D892,一覧表!$E:$X,10,FALSE),2)=\"短縮\",VLOOKUP(概要版1!D892,一覧表!$E:$X,10,FALSE),\"短縮\")","v":"短縮\n(75%)\n"},{"$f":"IF(VLOOKUP(概要版1!D892,一覧表!$E:$X,10,FALSE)=\"同程度\",\"■\",\"□\")","v":"□"},"同程度",{"$f":"IF(LEFT(VLOOKUP(概要版1!D892,一覧表!$E:$X,10,FALSE),2)=\"増加\",\"■\",\"□\")","v":"□"},{"$f":"IF(LEFT(VLOOKUP(概要版1!D892,一覧表!$E:$X,10,FALSE),2)=\"増加\",VLOOKUP(概要版1!D892,一覧表!$E:$X,10,FALSE),\"増加\")","v":"増加"},{"$f":"VLOOKUP(概要版1!D892,一覧表!$E:$X,16,FALSE)","v":"A"}]
[null,null,null,"品質",{"$f":"IF(VLOOKUP(概要版1!D892,一覧表!$E:$X,11,FALSE)=\"向上\",\"■\",\"□\")","v":"■"},"向上",{"$f":"IF(VLOOKUP(概要版1!D892,一覧表!$E:$X,11,FALSE)=\"同程度\",\"■\",\"□\")","v":"□"},"同程度",{"$f":"IF(VLOOKUP(概要版1!D892,一覧表!$E:$X,11,FALSE)=\"低下\",\"■\",\"□\")","v":"□"},"低下",{"$f":"VLOOKUP(概要版1!D892,一覧表!$E:$X,17,FALSE)","v":"B"}]
[null,null,null,"安全性",{"$f":"IF(VLOOKUP(概要版1!D892,一覧表!$E:$X,12,FALSE)=\"向上\",\"■\",\"□\")","v":"□"},"向上",{"$f":"IF(VLOOKUP(概要版1!D892,一覧表!$E:$X,12,FALSE)=\"同程度\",\"■\",\"□\")","v":"■"},"同程度",{"$f":"IF(VLOOKUP(概要版1!D892,一覧表!$E:$X,12,FALSE)=\"低下\",\"■\",\"□\")","v":"□"},"低下",{"$f":"VLOOKUP(概要版1!D892,一覧表!$E:$X,18,FALSE)","v":"B"}]
[null,null,null,"施工性",{"$f":"IF(VLOOKUP(概要版1!D892,一覧表!$E:$X,13,FALSE)=\"向上\",\"■\",\"□\")","v":"■"},"向上",{"$f":"IF(VLOOKUP(概要版1!D892,一覧表!$E:$X,13,FALSE)=\"同程度\",\"■\",\"□\")","v":"□"},"同程度",{"$f":"IF(VLOOKUP(概要版1!D892,一覧表!$E:$X,13,FALSE)=\"低下\",\"■\",\"□\")","v":"□"},"低下",{"$f":"VLOOKUP(概要版1!D892,一覧表!$E:$X,19,FALSE)","v":"A"}]
[null,null,null,"環境",{"$f":"IF(VLOOKUP(概要版1!D892,一覧表!$E:$X,14,FALSE)=\"向上\",\"■\",\"□\")","v":"□"},"向上",{"$f":"IF(VLOOKUP(概要版1!D892,一覧表!$E:$X,14,FALSE)=\"同程度\",\"■\",\"□\")","v":"■"},"同程度",{"$f":"IF(VLOOKUP(概要版1!D892,一覧表!$E:$X,14,FALSE)=\"低下\",\"■\",\"□\")","v":"□"},"低下",{"$f":"VLOOKUP(概要版1!D892,一覧表!$E:$X,20,FALSE)","v":"B"}]
[]
[]
[]
[]
[null,{"$f":"D916","v":"KT-150121-VE"}]
[null,null,null,"KT-150121-VE",null,null,null,{"$f":"\"有用な技術の位置づけ：\"&VLOOKUP(D916,一覧表!$E:$G,3,FALSE)","v":"有用な技術の位置づけ：活用促進"},null,null,null,null,null,null,null,{"$f":"HYPERLINK(\"#一覧表!h\"&MATCH(D916,一覧表!E:E,0),\"一覧表に戻る\")","v":"一覧表に戻る"},{"$f":"Q892+1","v":39}]
[null,null,null,{"$f":"\"（工種 ： \"&VLOOKUP(D916,一覧表!$E:$AE,25,FALSE)&\"－\"&VLOOKUP(D916,一覧表!$E:$AE,26,FALSE)&\"－\"&IF(VLOOKUP(D916,一覧表!$E:$AE,27,FALSE)=\"\",\"　　　　　\",VLOOKUP(D916,一覧表!$E:$AE,27,FALSE))&\"）\"","v":"（工種 ： 調査試験－構造物調査－非破壊試験、調査）"}]
[]
[null,null,null,{"$f":"VLOOKUP(D916,一覧表!$E:$L,2,FALSE)","v":"鋼管柱路面境界部腐食診断装置 コロージョンドクター"}]
[null,null,null,{"$f":"\"  副題 ： \"&VLOOKUP(D916,一覧表!$E:$AA,22,FALSE)","v":"  副題 ： 非破壊検査による超音波式鋼管柱路面境界部腐食診断装置"}]
[null,null,null,null,null,null,null,null,null,null,null,null,{"$f":"\"開発者名 ： \"&VLOOKUP(D916,一覧表!$E:$AA,23,FALSE)","v":"開発者名 ： 株式会社ジオファイブ"}]
[]
[null,null,null,"概要、新規性及び期待される効果等",null,null,null,null,null,null,null,null,"図表等"]
[]
[null,null,null,{"$f":"VLOOKUP(D916,一覧表!$E:$L,7,FALSE)","v":"本技術は、道路標識柱等、鋼管柱路面境界下の健全・腐食度合を超音波を使った非破壊で診断する技術で、従来は埋設部を掘削した後目視および超音波板厚計による腐食診断であった。本技術の活用により、掘削・復旧作業がなくなるので、経済性および施工性の向上が図れる。"}]
[null,null,null,"活用の効果"]
[null,null,null,{"$f":"\"比較する従来技術 ： \"&VLOOKUP(D916,一覧表!$E:$L,8,FALSE)","v":"比較する従来技術 ： 近接目視と掘削後超音波板厚計による鋼管柱路面境界部腐食診断"}]
[null,null,null,"項目","申請情報",null,null,null,null,null,"評価結果\n（C：同程度）"]
[null,null,null,"経済性",{"$f":"IF(LEFT(VLOOKUP(概要版1!D916,一覧表!$E:$X,9,FALSE),2)=\"向上\",\"■\",\"□\")","v":"■"},{"$f":"IF(LEFT(VLOOKUP(概要版1!D916,一覧表!$E:$X,9,FALSE),2)=\"向上\",VLOOKUP(概要版1!D916,一覧表!$E:$X,9,FALSE),\"向上\")","v":"向上\n(53%)\n"},{"$f":"IF(VLOOKUP(概要版1!D916,一覧表!$E:$X,9,FALSE)=\"同程度\",\"■\",\"□\")","v":"□"},"同程度",{"$f":"IF(LEFT(VLOOKUP(概要版1!D916,一覧表!$E:$X,9,FALSE),2)=\"低下\",\"■\",\"□\")","v":"□"},{"$f":"IF(LEFT(VLOOKUP(概要版1!D916,一覧表!$E:$X,9,FALSE),2)=\"低下\",VLOOKUP(概要版1!D916,一覧表!$E:$X,9,FALSE),\"低下\")","v":"低下"},{"$f":"VLOOKUP(概要版1!D916,一覧表!$E:$X,15,FALSE)","v":"B"}]
[null,null,null,"工程",{"$f":"IF(LEFT(VLOOKUP(概要版1!D916,一覧表!$E:$X,10,FALSE),2)=\"短縮\",\"■\",\"□\")","v":"■"},{"$f":"IF(LEFT(VLOOKUP(概要版1!D916,一覧表!$E:$X,10,FALSE),2)=\"短縮\",VLOOKUP(概要版1!D916,一覧表!$E:$X,10,FALSE),\"短縮\")","v":"短縮\n(80%)\n"},{"$f":"IF(VLOOKUP(概要版1!D916,一覧表!$E:$X,10,FALSE)=\"同程度\",\"■\",\"□\")","v":"□"},"同程度",{"$f":"IF(LEFT(VLOOKUP(概要版1!D916,一覧表!$E:$X,10,FALSE),2)=\"増加\",\"■\",\"□\")","v":"□"},{"$f":"IF(LEFT(VLOOKUP(概要版1!D916,一覧表!$E:$X,10,FALSE),2)=\"増加\",VLOOKUP(概要版1!D916,一覧表!$E:$X,10,FALSE),\"増加\")","v":"増加"},{"$f":"VLOOKUP(概要版1!D916,一覧表!$E:$X,16,FALSE)","v":"A"}]
[null,null,null,"品質",{"$f":"IF(VLOOKUP(概要版1!D916,一覧表!$E:$X,11,FALSE)=\"向上\",\"■\",\"□\")","v":"□"},"向上",{"$f":"IF(VLOOKUP(概要版1!D916,一覧表!$E:$X,11,FALSE)=\"同程度\",\"■\",\"□\")","v":"■"},"同程度",{"$f":"IF(VLOOKUP(概要版1!D916,一覧表!$E:$X,11,FALSE)=\"低下\",\"■\",\"□\")","v":"□"},"低下",{"$f":"VLOOKUP(概要版1!D916,一覧表!$E:$X,17,FALSE)","v":"C"}]
[null,null,null,"安全性",{"$f":"IF(VLOOKUP(概要版1!D916,一覧表!$E:$X,12,FALSE)=\"向上\",\"■\",\"□\")","v":"■"},"向上",{"$f":"IF(VLOOKUP(概要版1!D916,一覧表!$E:$X,12,FALSE)=\"同程度\",\"■\",\"□\")","v":"□"},"同程度",{"$f":"IF(VLOOKUP(概要版1!D916,一覧表!$E:$X,12,FALSE)=\"低下\",\"■\",\"□\")","v":"□"},"低下",{"$f":"VLOOKUP(概要版1!D916,一覧表!$E:$X,18,FALSE)","v":"B"}]
[null,null,null,"施工性",{"$f":"IF(VLOOKUP(概要版1!D916,一覧表!$E:$X,13,FALSE)=\"向上\",\"■\",\"□\")","v":"■"},"向上",{"$f":"IF(VLOOKUP(概要版1!D916,一覧表!$E:$X,13,FALSE)=\"同程度\",\"■\",\"□\")","v":"□"},"同程度",{"$f":"IF(VLOOKUP(概要版1!D916,一覧表!$E:$X,13,FALSE)=\"低下\",\"■\",\"□\")","v":"□"},"低下",{"$f":"VLOOKUP(概要版1!D916,一覧表!$E:$X,19,FALSE)","v":"B"}]
[null,null,null,"環境",{"$f":"IF(VLOOKUP(概要版1!D916,一覧表!$E:$X,14,FALSE)=\"向上\",\"■\",\"□\")","v":"■"},"向上",{"$f":"IF(VLOOKUP(概要版1!D916,一覧表!$E:$X,14,FALSE)=\"同程度\",\"■\",\"□\")","v":"□"},"同程度",{"$f":"IF(VLOOKUP(概要版1!D916,一覧表!$E:$X,14,FALSE)=\"低下\",\"■\",\"□\")","v":"□"},"低下",{"$f":"VLOOKUP(概要版1!D916,一覧表!$E:$X,20,FALSE)","v":"A"}]
[]
[]
[]
[]
[null,{"$f":"D940","v":"SK-160016-VE"}]
[null,null,null,"SK-160016-VE",null,null,null,{"$f":"\"有用な技術の位置づけ：\"&VLOOKUP(D940,一覧表!$E:$G,3,FALSE)","v":"有用な技術の位置づけ：活用促進"},null,null,null,null,null,null,null,{"$f":"HYPERLINK(\"#一覧表!h\"&MATCH(D940,一覧表!E:E,0),\"一覧表に戻る\")","v":"一覧表に戻る"},{"$f":"Q916+1","v":40}]
[null,null,null,{"$f":"\"（工種 ： \"&VLOOKUP(D940,一覧表!$E:$AE,25,FALSE)&\"－\"&VLOOKUP(D940,一覧表!$E:$AE,26,FALSE)&\"－\"&IF(VLOOKUP(D940,一覧表!$E:$AE,27,FALSE)=\"\",\"　　　　　\",VLOOKUP(D940,一覧表!$E:$AE,27,FALSE))&\"）\"","v":"（工種 ： 調査試験－構造物調査－その他）"}]
[]
[null,null,null,{"$f":"VLOOKUP(D940,一覧表!$E:$L,2,FALSE)","v":"浮き足場式工法(ゼニフロートX) "}]
[null,null,null,{"$f":"\"  副題 ： \"&VLOOKUP(D940,一覧表!$E:$AA,22,FALSE)","v":"  副題 ： 浮き足場を用いた橋梁等の点検・調査・補修技術"}]
[null,null,null,null,null,null,null,null,null,null,null,null,{"$f":"\"開発者名 ： \"&VLOOKUP(D940,一覧表!$E:$AA,23,FALSE)","v":"開発者名 ： ゼニヤ海洋サービス株式会社"}]
[]
[null,null,null,"概要、新規性及び期待される効果等",null,null,null,null,null,null,null,null,"図表等"]
[]
[null,null,null,{"$f":"VLOOKUP(D940,一覧表!$E:$L,7,FALSE)","v":"本技術は、ポリエチレン製の浮き足場(ゼニフロートX)を用途に合わせて組合せ、桁下高が水面から5m以内の橋梁点検・調査および補修工事等を行うものであり、従来は鋼製台船等で対応していた。本技術の採用により、作業の省力化および経済性の向上が期待できる。"}]
[null,null,null,"活用の効果"]
[null,null,null,{"$f":"\"比較する従来技術 ： \"&VLOOKUP(D940,一覧表!$E:$L,8,FALSE)","v":"比較する従来技術 ： 鋼製台船による橋梁点検・調査および補修工事等"}]
[null,null,null,"項目","申請情報",null,null,null,null,null,"評価結果\n（C：同程度）"]
[null,null,null,"経済性",{"$f":"IF(LEFT(VLOOKUP(概要版1!D940,一覧表!$E:$X,9,FALSE),2)=\"向上\",\"■\",\"□\")","v":"■"},{"$f":"IF(LEFT(VLOOKUP(概要版1!D940,一覧表!$E:$X,9,FALSE),2)=\"向上\",VLOOKUP(概要版1!D940,一覧表!$E:$X,9,FALSE),\"向上\")","v":"向上\n(37%)\n"},{"$f":"IF(VLOOKUP(概要版1!D940,一覧表!$E:$X,9,FALSE)=\"同程度\",\"■\",\"□\")","v":"□"},"同程度",{"$f":"IF(LEFT(VLOOKUP(概要版1!D940,一覧表!$E:$X,9,FALSE),2)=\"低下\",\"■\",\"□\")","v":"□"},{"$f":"IF(LEFT(VLOOKUP(概要版1!D940,一覧表!$E:$X,9,FALSE),2)=\"低下\",VLOOKUP(概要版1!D940,一覧表!$E:$X,9,FALSE),\"低下\")","v":"低下"},{"$f":"VLOOKUP(概要版1!D940,一覧表!$E:$X,15,FALSE)","v":"B"}]
[null,null,null,"工程",{"$f":"IF(LEFT(VLOOKUP(概要版1!D940,一覧表!$E:$X,10,FALSE),2)=\"短縮\",\"■\",\"□\")","v":"■"},{"$f":"IF(LEFT(VLOOKUP(概要版1!D940,一覧表!$E:$X,10,FALSE),2)=\"短縮\",VLOOKUP(概要版1!D940,一覧表!$E:$X,10,FALSE),\"短縮\")","v":"短縮\n(25%)\n"},{"$f":"IF(VLOOKUP(概要版1!D940,一覧表!$E:$X,10,FALSE)=\"同程度\",\"■\",\"□\")","v":"□"},"同程度",{"$f":"IF(LEFT(VLOOKUP(概要版1!D940,一覧表!$E:$X,10,FALSE),2)=\"増加\",\"■\",\"□\")","v":"□"},{"$f":"IF(LEFT(VLOOKUP(概要版1!D940,一覧表!$E:$X,10,FALSE),2)=\"増加\",VLOOKUP(概要版1!D940,一覧表!$E:$X,10,FALSE),\"増加\")","v":"増加"},{"$f":"VLOOKUP(概要版1!D940,一覧表!$E:$X,16,FALSE)","v":"B"}]
[null,null,null,"品質",{"$f":"IF(VLOOKUP(概要版1!D940,一覧表!$E:$X,11,FALSE)=\"向上\",\"■\",\"□\")","v":"□"},"向上",{"$f":"IF(VLOOKUP(概要版1!D940,一覧表!$E:$X,11,FALSE)=\"同程度\",\"■\",\"□\")","v":"■"},"同程度",{"$f":"IF(VLOOKUP(概要版1!D940,一覧表!$E:$X,11,FALSE)=\"低下\",\"■\",\"□\")","v":"□"},"低下",{"$f":"VLOOKUP(概要版1!D940,一覧表!$E:$X,17,FALSE)","v":"ー"}]
[null,null,null,"安全性",{"$f":"IF(VLOOKUP(概要版1!D940,一覧表!$E:$X,12,FALSE)=\"向上\",\"■\",\"□\")","v":"■"},"向上",{"$f":"IF(VLOOKUP(概要版1!D940,一覧表!$E:$X,12,FALSE)=\"同程度\",\"■\",\"□\")","v":"□"},"同程度",{"$f":"IF(VLOOKUP(概要版1!D940,一覧表!$E:$X,12,FALSE)=\"低下\",\"■\",\"□\")","v":"□"},"低下",{"$f":"VLOOKUP(概要版1!D940,一覧表!$E:$X,18,FALSE)","v":"B"}]
[null,null,null,"施工性",{"$f":"IF(VLOOKUP(概要版1!D940,一覧表!$E:$X,13,FALSE)=\"向上\",\"■\",\"□\")","v":"■"},"向上",{"$f":"IF(VLOOKUP(概要版1!D940,一覧表!$E:$X,13,FALSE)=\"同程度\",\"■\",\"□\")","v":"□"},"同程度",{"$f":"IF(VLOOKUP(概要版1!D940,一覧表!$E:$X,13,FALSE)=\"低下\",\"■\",\"□\")","v":"□"},"低下",{"$f":"VLOOKUP(概要版1!D940,一覧表!$E:$X,19,FALSE)","v":"B"}]
[null,null,null,"環境",{"$f":"IF(VLOOKUP(概要版1!D940,一覧表!$E:$X,14,FALSE)=\"向上\",\"■\",\"□\")","v":"□"},"向上",{"$f":"IF(VLOOKUP(概要版1!D940,一覧表!$E:$X,14,FALSE)=\"同程度\",\"■\",\"□\")","v":"■"},"同程度",{"$f":"IF(VLOOKUP(概要版1!D940,一覧表!$E:$X,14,FALSE)=\"低下\",\"■\",\"□\")","v":"□"},"低下",{"$f":"VLOOKUP(概要版1!D940,一覧表!$E:$X,20,FALSE)","v":"C"}]
[]
[]
[]
[]
[null,{"$f":"D964","v":"HK-150004-VE"}]
[null,null,null,"HK-150004-VE",null,null,null,{"$f":"\"有用な技術の位置づけ：\"&VLOOKUP(D964,一覧表!$E:$G,3,FALSE)","v":"有用な技術の位置づけ：活用促進"},null,null,null,null,null,null,null,{"$f":"HYPERLINK(\"#一覧表!h\"&MATCH(D964,一覧表!E:E,0),\"一覧表に戻る\")","v":"一覧表に戻る"},{"$f":"Q940+1","v":41}]
[null,null,null,{"$f":"\"（工種 ： \"&VLOOKUP(D964,一覧表!$E:$AE,25,FALSE)&\"－\"&VLOOKUP(D964,一覧表!$E:$AE,26,FALSE)&\"－\"&IF(VLOOKUP(D964,一覧表!$E:$AE,27,FALSE)=\"\",\"　　　　　\",VLOOKUP(D964,一覧表!$E:$AE,27,FALSE))&\"）\"","v":"（工種 ： 調査試験－構造物調査－その他）"}]
[]
[null,null,null,{"$f":"VLOOKUP(D964,一覧表!$E:$L,2,FALSE)","v":"Single i工法(シングルi工法)"}]
[null,null,null,{"$f":"\"  副題 ： \"&VLOOKUP(D964,一覧表!$E:$AA,22,FALSE)","v":"  副題 ： コンクリート内部に発生したひび割れや空洞を正確に検査しその場で確認できるシステム"}]
[null,null,null,null,null,null,null,null,null,null,null,null,{"$f":"\"開発者名 ： \"&VLOOKUP(D964,一覧表!$E:$AA,23,FALSE)","v":"開発者名 ： 株式会社ティ・エス・プランニング/一般社団法人日本建設機械施工協会 施工技術総合研究所"}]
[]
[null,null,null,"概要、新規性及び期待される効果等",null,null,null,null,null,null,null,null,"図表等"]
[]
[null,null,null,{"$f":"VLOOKUP(D964,一覧表!$E:$L,7,FALSE)","v":"1.コンクリート内部に発生したひび割れや空洞、剥離等を正確にその場で検査できる 2.穿孔穴から特殊カラー樹脂を注入することで、同一箇所から再穿孔しても角欠けが起きず内視鏡で動画等の正確なデータを取得し、1枚の写真化にしてコンクリート色と樹脂の色分けができる"}]
[null,null,null,"活用の効果"]
[null,null,null,{"$f":"\"比較する従来技術 ： \"&VLOOKUP(D964,一覧表!$E:$L,8,FALSE)","v":"比較する従来技術 ： 直径100mmコアによる調査法(蛍光エポキシ樹脂真空含浸法)"}]
[null,null,null,"項目","申請情報",null,null,null,null,null,"評価結果\n（C：同程度）"]
[null,null,null,"経済性",{"$f":"IF(LEFT(VLOOKUP(概要版1!D964,一覧表!$E:$X,9,FALSE),2)=\"向上\",\"■\",\"□\")","v":"■"},{"$f":"IF(LEFT(VLOOKUP(概要版1!D964,一覧表!$E:$X,9,FALSE),2)=\"向上\",VLOOKUP(概要版1!D964,一覧表!$E:$X,9,FALSE),\"向上\")","v":"向上\n(47%)\n"},{"$f":"IF(VLOOKUP(概要版1!D964,一覧表!$E:$X,9,FALSE)=\"同程度\",\"■\",\"□\")","v":"□"},"同程度",{"$f":"IF(LEFT(VLOOKUP(概要版1!D964,一覧表!$E:$X,9,FALSE),2)=\"低下\",\"■\",\"□\")","v":"□"},{"$f":"IF(LEFT(VLOOKUP(概要版1!D964,一覧表!$E:$X,9,FALSE),2)=\"低下\",VLOOKUP(概要版1!D964,一覧表!$E:$X,9,FALSE),\"低下\")","v":"低下"},{"$f":"VLOOKUP(概要版1!D964,一覧表!$E:$X,15,FALSE)","v":"B"}]
[null,null,null,"工程",{"$f":"IF(LEFT(VLOOKUP(概要版1!D964,一覧表!$E:$X,10,FALSE),2)=\"短縮\",\"■\",\"□\")","v":"■"},{"$f":"IF(LEFT(VLOOKUP(概要版1!D964,一覧表!$E:$X,10,FALSE),2)=\"短縮\",VLOOKUP(概要版1!D964,一覧表!$E:$X,10,FALSE),\"短縮\")","v":"短縮\n(43%)\n"},{"$f":"IF(VLOOKUP(概要版1!D964,一覧表!$E:$X,10,FALSE)=\"同程度\",\"■\",\"□\")","v":"□"},"同程度",{"$f":"IF(LEFT(VLOOKUP(概要版1!D964,一覧表!$E:$X,10,FALSE),2)=\"増加\",\"■\",\"□\")","v":"□"},{"$f":"IF(LEFT(VLOOKUP(概要版1!D964,一覧表!$E:$X,10,FALSE),2)=\"増加\",VLOOKUP(概要版1!D964,一覧表!$E:$X,10,FALSE),\"増加\")","v":"増加"},{"$f":"VLOOKUP(概要版1!D964,一覧表!$E:$X,16,FALSE)","v":"B"}]
[null,null,null,"品質",{"$f":"IF(VLOOKUP(概要版1!D964,一覧表!$E:$X,11,FALSE)=\"向上\",\"■\",\"□\")","v":"□"},"向上",{"$f":"IF(VLOOKUP(概要版1!D964,一覧表!$E:$X,11,FALSE)=\"同程度\",\"■\",\"□\")","v":"■"},"同程度",{"$f":"IF(VLOOKUP(概要版1!D964,一覧表!$E:$X,11,FALSE)=\"低下\",\"■\",\"□\")","v":"□"},"低下",{"$f":"VLOOKUP(概要版1!D964,一覧表!$E:$X,17,FALSE)","v":"A"}]
[null,null,null,"安全性",{"$f":"IF(VLOOKUP(概要版1!D964,一覧表!$E:$X,12,FALSE)=\"向上\",\"■\",\"□\")","v":"□"},"向上",{"$f":"IF(VLOOKUP(概要版1!D964,一覧表!$E:$X,12,FALSE)=\"同程度\",\"■\",\"□\")","v":"■"},"同程度",{"$f":"IF(VLOOKUP(概要版1!D964,一覧表!$E:$X,12,FALSE)=\"低下\",\"■\",\"□\")","v":"□"},"低下",{"$f":"VLOOKUP(概要版1!D964,一覧表!$E:$X,18,FALSE)","v":"B"}]
[null,null,null,"施工性",{"$f":"IF(VLOOKUP(概要版1!D964,一覧表!$E:$X,13,FALSE)=\"向上\",\"■\",\"□\")","v":"■"},"向上",{"$f":"IF(VLOOKUP(概要版1!D964,一覧表!$E:$X,13,FALSE)=\"同程度\",\"■\",\"□\")","v":"□"},"同程度",{"$f":"IF(VLOOKUP(概要版1!D964,一覧表!$E:$X,13,FALSE)=\"低下\",\"■\",\"□\")","v":"□"},"低下",{"$f":"VLOOKUP(概要版1!D964,一覧表!$E:$X,19,FALSE)","v":"A"}]
[null,null,null,"環境",{"$f":"IF(VLOOKUP(概要版1!D964,一覧表!$E:$X,14,FALSE)=\"向上\",\"■\",\"□\")","v":"□"},"向上",{"$f":"IF(VLOOKUP(概要版1!D964,一覧表!$E:$X,14,FALSE)=\"同程度\",\"■\",\"□\")","v":"■"},"同程度",{"$f":"IF(VLOOKUP(概要版1!D964,一覧表!$E:$X,14,FALSE)=\"低下\",\"■\",\"□\")","v":"□"},"低下",{"$f":"VLOOKUP(概要版1!D964,一覧表!$E:$X,20,FALSE)","v":"B"}]
[]
[]
[]
[]
[null,{"$f":"D988","v":"CG-170010-VE"}]
[null,null,null,"CG-170010-VE",null,null,null,{"$f":"\"有用な技術の位置づけ：\"&VLOOKUP(D988,一覧表!$E:$G,3,FALSE)","v":"有用な技術の位置づけ：活用促進"},null,null,null,null,null,null,null,{"$f":"HYPERLINK(\"#一覧表!h\"&MATCH(D988,一覧表!E:E,0),\"一覧表に戻る\")","v":"一覧表に戻る"},{"$f":"Q964+1","v":42}]
[null,null,null,{"$f":"\"（工種 ： \"&VLOOKUP(D988,一覧表!$E:$AE,25,FALSE)&\"－\"&VLOOKUP(D988,一覧表!$E:$AE,26,FALSE)&\"－\"&IF(VLOOKUP(D988,一覧表!$E:$AE,27,FALSE)=\"\",\"　　　　　\",VLOOKUP(D988,一覧表!$E:$AE,27,FALSE))&\"）\"","v":"（工種 ： 調査試験－分析・予測システム－　　　　　）"}]
[]
[null,null,null,{"$f":"VLOOKUP(D988,一覧表!$E:$L,2,FALSE)","v":"道路管理画像を用いた路面評価システム"}]
[null,null,null,{"$f":"\"  副題 ： \"&VLOOKUP(D988,一覧表!$E:$AA,22,FALSE)","v":"  副題 ： 画像を利用した「ひび割れ率 」の算出にAIを活用した自動判読を取り入れ、路面評価等を効率化する「簡易PMS」を取り入れた路面評価システム"}]
[null,null,null,null,null,null,null,null,null,null,null,null,{"$f":"\"開発者名 ： \"&VLOOKUP(D988,一覧表!$E:$AA,23,FALSE)","v":"開発者名 ： 西日本高速道路エンジニアリング中国株式会社 "}]
[]
[null,null,null,"概要、新規性及び期待される効果等",null,null,null,null,null,null,null,null,"図表等"]
[]
[null,null,null,{"$f":"VLOOKUP(D988,一覧表!$E:$L,7,FALSE)","v":"路面静止画を利用した技術者判読に、AIを活用した自動判読を取り入れ「ひび割れ率」を効率的に算出する技術です。さらに、IRI値・ひび割れ率・わだち掘れレベルの3指標で評価する「簡易PMS」の活用で、損傷分布状況の把握や補修箇所の選定等が容易にできる技術です。 "}]
[null,null,null,"活用の効果"]
[null,null,null,{"$f":"\"比較する従来技術 ： \"&VLOOKUP(D988,一覧表!$E:$L,8,FALSE)","v":"比較する従来技術 ： 路面のひび割れ測定方法(スケッチ法)を用いた路面管理 "}]
[null,null,null,"項目","申請情報",null,null,null,null,null,"評価結果\n（C：同程度）"]
[null,null,null,"経済性",{"$f":"IF(LEFT(VLOOKUP(概要版1!D988,一覧表!$E:$X,9,FALSE),2)=\"向上\",\"■\",\"□\")","v":"■"},{"$f":"IF(LEFT(VLOOKUP(概要版1!D988,一覧表!$E:$X,9,FALSE),2)=\"向上\",VLOOKUP(概要版1!D988,一覧表!$E:$X,9,FALSE),\"向上\")","v":"向上\n(93%)\n"},{"$f":"IF(VLOOKUP(概要版1!D988,一覧表!$E:$X,9,FALSE)=\"同程度\",\"■\",\"□\")","v":"□"},"同程度",{"$f":"IF(LEFT(VLOOKUP(概要版1!D988,一覧表!$E:$X,9,FALSE),2)=\"低下\",\"■\",\"□\")","v":"□"},{"$f":"IF(LEFT(VLOOKUP(概要版1!D988,一覧表!$E:$X,9,FALSE),2)=\"低下\",VLOOKUP(概要版1!D988,一覧表!$E:$X,9,FALSE),\"低下\")","v":"低下"},{"$f":"VLOOKUP(概要版1!D988,一覧表!$E:$X,15,FALSE)","v":"B"}]
[null,null,null,"工程",{"$f":"IF(LEFT(VLOOKUP(概要版1!D988,一覧表!$E:$X,10,FALSE),2)=\"短縮\",\"■\",\"□\")","v":"■"},{"$f":"IF(LEFT(VLOOKUP(概要版1!D988,一覧表!$E:$X,10,FALSE),2)=\"短縮\",VLOOKUP(概要版1!D988,一覧表!$E:$X,10,FALSE),\"短縮\")","v":"短縮\n(82%)\n"},{"$f":"IF(VLOOKUP(概要版1!D988,一覧表!$E:$X,10,FALSE)=\"同程度\",\"■\",\"□\")","v":"□"},"同程度",{"$f":"IF(LEFT(VLOOKUP(概要版1!D988,一覧表!$E:$X,10,FALSE),2)=\"増加\",\"■\",\"□\")","v":"□"},{"$f":"IF(LEFT(VLOOKUP(概要版1!D988,一覧表!$E:$X,10,FALSE),2)=\"増加\",VLOOKUP(概要版1!D988,一覧表!$E:$X,10,FALSE),\"増加\")","v":"増加"},{"$f":"VLOOKUP(概要版1!D988,一覧表!$E:$X,16,FALSE)","v":"B"}]
[null,null,null,"品質",{"$f":"IF(VLOOKUP(概要版1!D988,一覧表!$E:$X,11,FALSE)=\"向上\",\"■\",\"□\")","v":"■"},"向上",{"$f":"IF(VLOOKUP(概要版1!D988,一覧表!$E:$X,11,FALSE)=\"同程度\",\"■\",\"□\")","v":"□"},"同程度",{"$f":"IF(VLOOKUP(概要版1!D988,一覧表!$E:$X,11,FALSE)=\"低下\",\"■\",\"□\")","v":"□"},"低下",{"$f":"VLOOKUP(概要版1!D988,一覧表!$E:$X,17,FALSE)","v":"B"}]
[null,null,null,"安全性",{"$f":"IF(VLOOKUP(概要版1!D988,一覧表!$E:$X,12,FALSE)=\"向上\",\"■\",\"□\")","v":"■"},"向上",{"$f":"IF(VLOOKUP(概要版1!D988,一覧表!$E:$X,12,FALSE)=\"同程度\",\"■\",\"□\")","v":"□"},"同程度",{"$f":"IF(VLOOKUP(概要版1!D988,一覧表!$E:$X,12,FALSE)=\"低下\",\"■\",\"□\")","v":"□"},"低下",{"$f":"VLOOKUP(概要版1!D988,一覧表!$E:$X,18,FALSE)","v":"B"}]
[null,null,null,"施工性",{"$f":"IF(VLOOKUP(概要版1!D988,一覧表!$E:$X,13,FALSE)=\"向上\",\"■\",\"□\")","v":"■"},"向上",{"$f":"IF(VLOOKUP(概要版1!D988,一覧表!$E:$X,13,FALSE)=\"同程度\",\"■\",\"□\")","v":"□"},"同程度",{"$f":"IF(VLOOKUP(概要版1!D988,一覧表!$E:$X,13,FALSE)=\"低下\",\"■\",\"□\")","v":"□"},"低下",{"$f":"VLOOKUP(概要版1!D988,一覧表!$E:$X,19,FALSE)","v":"B"}]
[null,null,null,"環境",{"$f":"IF(VLOOKUP(概要版1!D988,一覧表!$E:$X,14,FALSE)=\"向上\",\"■\",\"□\")","v":"■"},"向上",{"$f":"IF(VLOOKUP(概要版1!D988,一覧表!$E:$X,14,FALSE)=\"同程度\",\"■\",\"□\")","v":"□"},"同程度",{"$f":"IF(VLOOKUP(概要版1!D988,一覧表!$E:$X,14,FALSE)=\"低下\",\"■\",\"□\")","v":"□"},"低下",{"$f":"VLOOKUP(概要版1!D988,一覧表!$E:$X,20,FALSE)","v":"B"}]